{"text_format":"1","workbook":"xlsx","n_sheets":23,"sheets":["Residential","HEM Table","TestCases","Commercial","SEIC","Validation","Tax Table","Inputs","Data","Version Control","CommercialData","CommercialTestCases","BBS & BAS","User Guide - Residential","User Guide - Commercial","User Guide - SEIC","Assessment Notes - Commercial","Assessment Notes - Residential","Jackson Data Entry","Cashflow Sensitivity Model","YTD","Workings","Rental Schedule"],"not_rendered":{"charts":0,"images":5,"macros":1,"external_links":0,"defined_names":201,"comments":6,"pivot_tables":0},"unopened":[],"bounds":{"document_bytes":16777216,"sheet_cells":100000,"rows_first":2000,"rows_last":500,"rows_between":2000,"halvings":0,"cell_chars":16384,"cell_head_chars":4096},"cells_cut":0,"cells_raw":0,"read":"whole","date_system":"1900"}

{"sheet":"Residential","index":0,"n_rows":92,"n_cols":18,"rows_kept":92,"cut":false,"hidden":false,"merged":[[5,4,5,8],[49,8,49,10],[50,8,50,10],[51,8,51,10],[52,8,52,10],[48,2,48,4],[48,8,48,10],[50,2,50,4],[51,2,51,4],[52,2,52,4],[12,10,12,15],[41,12,41,14],[40,12,40,14],[42,12,42,14],[49,2,49,4],[40,6,40,8],[91,2,91,15],[77,6,78,6],[59,2,59,4],[60,2,60,4],[77,14,78,14],[84,12,85,14],[84,6,85,10],[86,6,86,10],[86,12,86,14],[69,8,69,10],[61,2,61,4],[62,2,62,4],[64,2,64,4],[63,2,63,4],[57,10,60,14],[57,2,57,4],[90,2,90,6],[89,2,89,14],[90,8,90,14],[7,10,7,12],[87,2,87,15],[53,2,53,4],[54,2,54,4],[55,2,55,4],[56,2,56,4],[58,2,58,4]]}
[]
[null,null,"Home Loan Serviceability Calculator"]
[null,null,"Version 6.4 31st October 2023"]
[]
[]
[null,null,"Applicant Name"]
[]
[null,null,"Loan Details",null,null,null,null,"Interest Rate Buffer:",null,null,0.02]
[null,null,"(including capitalised fees)",null,null,null,"WAVG Assessment Rate",null,{"$f":"MAX(BaselineAssessmentRate,ResiWAVGInterestRate+AssessmentLoading)","v":5.5E-2}]
[null,null,"New Loan Amount",null,null,null,"Interest Rate",5,null,null,"Loan Term",null,null,null,"IO Term"]
[null,null,"New Loan Amount"]
[null,null,"Total Loan Amount",null,{"$f":"SUM(E10:E11)","v":0},null,"WAVG Interest Rate",null,{"$f":"IF(ResiNewLoanTotalAmount=0,0,((ResiNewLoanAmount1*ResiInterestRate1)+(ResiNewLoanAmount2*ResiInterestRate2))/ResiNewLoanTotalAmount)","v":0},null,"WAVG Loan Term",null,{"$f":"IF(ResiNewLoanTotalAmount=0,0,((ResiNewLoanAmount1*ResiLoanTerm1)+(ResiNewLoanAmount2*ResiLoanTerm2))/ResiNewLoanTotalAmount)","v":0},null,"WAVG IO Term",{"$f":"IF(ResiNewLoanTotalAmount=0,0,((ResiNewLoanAmount1*ResiLoanIOTerm1)+(ResiNewLoanAmount2*ResiLoanIOTerm2))/ResiNewLoanTotalAmount)","v":0}]
[null,null,null,null,null,null,null,null,null,null,{"$f":"IF(ResiWAVGLoanTerm>MaximumLoanTermInYearsForPrimeLoans, \"Loans Terms > \" & MaximumLoanTermInYearsForPrimeLoans & \" years not available on Prime\", \" \")","v":" "}]
[null,null,"Applicant Details:",null,"Applicant 1",null,"Applicant 2",null,"Applicant 3",null,"Applicant 4",null,"Applicant 5",null,"Applicant 6",null,null,"Total"]
[null,null,"Status"]
[null,null,"Individual (Couple) With","Applicant 1"]
[null,null,"Dependants"]
[null,null,null,null,{"$f":"IF(AND(SUM(E19:E23,E25:E26)<>0,E15=\"\"),\"Enter a Status\",\"\")","v":""},null,{"$f":"IF(AND(SUM(G19:G23,G25:G26)<>0,G15=\"\"),\"Enter a Status\",\"\")","v":""},null,{"$f":"IF(AND(SUM(I19:I23,I25:I26)<>0,I15=\"\"),\"Enter a Status\",\"\")","v":""},null,{"$f":"IF(AND(SUM(K19:K23,K25:K26)<>0,K15=\"\"),\"Enter a Status\",\"\")","v":""},null,{"$f":"IF(AND(SUM(M19:M23,M25:M26)<>0,M15=\"\"),\"Enter a Status\",\"\")","v":""},null,{"$f":"IF(AND(SUM(O19:O23,O25:O26)<>0,O15=\"\"),\"Enter a Status\",\"\")","v":""}]
[null,null,"Gross Annual Income"]
[" ",null,"Untaxed Allowable Income",null,null,null,null,null,null,null,null,null,null,null,null,null,null,{"$f":"(E20+G20+I20+K20+M20+O20)","v":0}]
[null,null,"Self Employed Income"]
[null,null,"Addbacks"]
[null,null,"Business NPBT"]
[]
[null,null,"Gross Rental Income",null,null,null,null,null,null,null,null,null,null,null,null,null,null,{"$f":"(E25+G25+I25+K25+M25+O25)","v":0}]
[null,null,"Investment Property Loan Balance"]
[null,null,"Total Income",null,{"$f":"E25*RentalIncomeShading+E19+E20+E21+E22+E23","v":0},null,{"$f":"G25*RentalIncomeShading+G19+G20+G21+G22+G23","v":0},null,{"$f":"I25*RentalIncomeShading+I19+I20+I21+I22+I23","v":0},null,{"$f":"K25*RentalIncomeShading+K19+K20+K21+K22+K23","v":0},null,{"$f":"M25*RentalIncomeShading+M19+M20+M21+M22+M23","v":0},null,{"$f":"O25*RentalIncomeShading+O19+O20+O21+O22+O23","v":0},null,null,{"$f":"(E27+G27+I27+K27+M27+O27)","v":0}]
[null,null,"Is an Applicant",null,{"$f":"AND(E15<>\"\")","v":false},null,{"$f":"AND(G15<>\"\")","v":false},null,{"$f":"AND(I15<>\"\")","v":false},null,{"$f":"AND(K15<>\"\")","v":false},null,{"$f":"AND(M15<>\"\")","v":false},null,{"$f":"AND(O15<>\"\")","v":false}]
[null,null,"Spouse Dependants",null,{"$f":"IFERROR(HLOOKUP(E16,ResiApplicantDetailsTable,4,FALSE),0)","v":0},null,{"$f":"IFERROR(HLOOKUP(G16,ResiApplicantDetailsTable,4,FALSE),0)","v":0},null,{"$f":"IFERROR(HLOOKUP(I16,ResiApplicantDetailsTable,4,FALSE),0)","v":0},null,{"$f":"IFERROR(HLOOKUP(K16,ResiApplicantDetailsTable,4,FALSE),0)","v":0},null,{"$f":"IFERROR(HLOOKUP(M16,ResiApplicantDetailsTable,4,FALSE),0)","v":0},null,{"$f":"IFERROR(HLOOKUP(O16,ResiApplicantDetailsTable,4,FALSE),0)","v":0}]
[null,null,"Pepper Status Code","Applicant 1",{"$f":"IF(E$15=\"Individual (Couple)\",\"P-C\",IF(E$15=\"Individual (Single)\",\"P-S\",\"\"))","v":""},null,{"$f":"IF(G$15=\"Individual (Couple)\",\"P-C\",IF(G$15=\"Individual (Single)\",\"P-S\",\"\"))","v":""},null,{"$f":"IF(I$15=\"Individual (Couple)\",\"P-C\",IF(I$15=\"Individual (Single)\",\"P-S\",\"\"))","v":""},null,{"$f":"IF(K$15=\"Individual (Couple)\",\"P-C\",IF(K$15=\"Individual (Single)\",\"P-S\",\"\"))","v":""},null,{"$f":"IF(M$15=\"Individual (Couple)\",\"P-C\",IF(M$15=\"Individual (Single)\",\"P-S\",\"\"))","v":""},null,{"$f":"IF(O$15=\"Individual (Couple)\",\"P-C\",IF(O$15=\"Individual (Single)\",\"P-S\",\"\"))","v":""}]
[null,null,"Pepper Dependents Code",null,{"$f":"IF(E$15=\"Individual (Couple)\",\"P-CD\"&INDEX(Validation!$B$21:$B$26,MATCH((E$17+E$29),Validation!$A$21:$A$26,1)),IF(E$15=\"Individual (Single)\",\"P-SD\"&INDEX(Validation!$B$21:$B$26,MATCH((E$17+E$29),Validation!$A$21:$A$26,1)),\"\"))","v":""},null,{"$f":"IF(G$15=\"Individual (Couple)\",\"P-CD\"&INDEX(Validation!$B$21:$B$26,MATCH((G$17+G$29),Validation!$A$21:$A$26,1)),IF(G$15=\"Individual (Single)\",\"P-SD\"&INDEX(Validation!$B$21:$B$26,MATCH((G$17+G$29),Validation!$A$21:$A$26,1)),\"\"))","v":""},null,{"$f":"IF(I$15=\"Individual (Couple)\",\"P-CD\"&INDEX(Validation!$B$21:$B$26,MATCH((I$17+I$29),Validation!$A$21:$A$26,1)),IF(I$15=\"Individual (Single)\",\"P-SD\"&INDEX(Validation!$B$21:$B$26,MATCH((I$17+I$29),Validation!$A$21:$A$26,1)),\"\"))","v":""},null,{"$f":"IF(K$15=\"Individual (Couple)\",\"P-CD\"&INDEX(Validation!$B$21:$B$26,MATCH((K$17+K$29),Validation!$A$21:$A$26,1)),IF(K$15=\"Individual (Single)\",\"P-SD\"&INDEX(Validation!$B$21:$B$26,MATCH((K$17+K$29),Validation!$A$21:$A$26,1)),\"\"))","v":""},null,{"$f":"IF(M$15=\"Individual (Couple)\",\"P-CD\"&INDEX(Validation!$B$21:$B$26,MATCH((M$17+M$29),Validation!$A$21:$A$26,1)),IF(M$15=\"Individual (Single)\",\"P-SD\"&INDEX(Validation!$B$21:$B$26,MATCH((M$17+M$29),Validation!$A$21:$A$26,1)),\"\"))","v":""},null,{"$f":"IF(O$15=\"Individual (Couple)\",\"P-CD\"&INDEX(Validation!$B$21:$B$26,MATCH((O$17+O$29),Validation!$A$21:$A$26,1)),IF(O$15=\"Individual (Single)\",\"P-SD\"&INDEX(Validation!$B$21:$B$26,MATCH((O$17+O$29),Validation!$A$21:$A$26,1)),\"\"))","v":""}]
[null,null,"Exclude for LE calc",null,{"$f":"IFERROR(IF(MATCH(E16,$E$14:$O$14,0)<(COLUMN()-COLUMN($E$14:$O$14)+1),TRUE,FALSE),FALSE)","v":false},null,{"$f":"IFERROR(IF(MATCH(G16,$E$14:$O$14,0)<(COLUMN()-COLUMN($E$14:$O$14)+1),TRUE,FALSE),FALSE)","v":false},null,{"$f":"IFERROR(IF(MATCH(I16,$E$14:$O$14,0)<(COLUMN()-COLUMN($E$14:$O$14)+1),TRUE,FALSE),FALSE)","v":false},null,{"$f":"IFERROR(IF(MATCH(K16,$E$14:$O$14,0)<(COLUMN()-COLUMN($E$14:$O$14)+1),TRUE,FALSE),FALSE)","v":false},null,{"$f":"IFERROR(IF(MATCH(M16,$E$14:$O$14,0)<(COLUMN()-COLUMN($E$14:$O$14)+1),TRUE,FALSE),FALSE)","v":false},null,{"$f":"IFERROR(IF(MATCH(O16,$E$14:$O$14,0)<(COLUMN()-COLUMN($E$14:$O$14)+1),TRUE,FALSE),FALSE)","v":false}]
[null,null,"Workings for Negative Gearing",null,{"$f":"IF(E26>0,E26*WorkingsForNegativeGearing+($G$52*12*(E26/SUM($E$26,$G$26,$I$26,$K$26,$M$26,$O$26))),0)","v":0},null,{"$f":"IF(G26>0,G26*WorkingsForNegativeGearing+($G$52*12*(G26/SUM($E$26,$G$26,$I$26,$K$26,$M$26,$O$26))),0)","v":0},null,{"$f":"IF(I26>0,I26*WorkingsForNegativeGearing+($G$52*12*(I26/SUM($E$26,$G$26,$I$26,$K$26,$M$26,$O$26))),0)","v":0},null,{"$f":"IF(K26>0,K26*WorkingsForNegativeGearing+($G$52*12*(K26/SUM($E$26,$G$26,$I$26,$K$26,$M$26,$O$26))),0)","v":0},null,{"$f":"IF(M26>0,M26*WorkingsForNegativeGearing+($G$52*12*(M26/SUM($E$26,$G$26,$I$26,$K$26,$M$26,$O$26))),0)","v":0},null,{"$f":"IF(O26>0,O26*WorkingsForNegativeGearing+($G$52*12*(O26/SUM($E$26,$G$26,$I$26,$K$26,$M$26,$O$26))),0)","v":0}]
[null,null,"Total Taxable Income Exc Business NPBT",null,{"$f":"MAX(0,E19+E25*RentalIncomeShading-E33+E21)","v":0},null,{"$f":"MAX(0,G19+G25*RentalIncomeShading-G33+G21)","v":0},null,{"$f":"MAX(0,I19+I25*RentalIncomeShading-I33+I21)","v":0},null,{"$f":"MAX(0,K19+K25*RentalIncomeShading-K33+K21)","v":0},null,{"$f":"MAX(0,M19+M25*RentalIncomeShading-M33+M21)","v":0},null,{"$f":"MAX(0,O19+O25*RentalIncomeShading-O33+O21)","v":0},null,null,{"$f":"(E34+G34+I34+K34+M34+O34)","v":0}]
[null,null,"Spouse Income",null,{"$f":"IFERROR(HLOOKUP(E16,$E$14:$O$27,ROWS($E$14:$O$27),FALSE),0)-IFERROR(HLOOKUP(E16,$E$14:$O$33,ROWS($E$14:$O$33),FALSE),0)","v":0},null,{"$f":"IFERROR(HLOOKUP(G16,$E$14:$O$27,ROWS($E$14:$O$27),FALSE),0)-IFERROR(HLOOKUP(G16,$E$14:$O$33,ROWS($E$14:$O$33),FALSE),0)","v":0},null,{"$f":"IFERROR(HLOOKUP(I16,$E$14:$O$27,ROWS($E$14:$O$27),FALSE),0)-IFERROR(HLOOKUP(I16,$E$14:$O$33,ROWS($E$14:$O$33),FALSE),0)","v":0},null,{"$f":"IFERROR(HLOOKUP(K16,$E$14:$O$27,ROWS($E$14:$O$27),FALSE),0)-IFERROR(HLOOKUP(K16,$E$14:$O$33,ROWS($E$14:$O$33),FALSE),0)","v":0},null,{"$f":"IFERROR(HLOOKUP(M16,$E$14:$O$27,ROWS($E$14:$O$27),FALSE),0)-IFERROR(HLOOKUP(M16,$E$14:$O$33,ROWS($E$14:$O$33),FALSE),0)","v":0},null,{"$f":"IFERROR(HLOOKUP(O16,$E$14:$O$27,ROWS($E$14:$O$27),FALSE),0)-IFERROR(HLOOKUP(O16,$E$14:$O$33,ROWS($E$14:$O$33),FALSE),0)","v":0}]
[null,null,"Income Bracket",null,{"$f":" IFERROR(HLOOKUP(E27+E35-E33,HemCombinedIncomeRange,3,TRUE),1)","v":1},null,{"$f":" IFERROR(HLOOKUP(G27+G35-G33,HemCombinedIncomeRange,3,TRUE),1)","v":1},null,{"$f":" IFERROR(HLOOKUP(I27+I35-I33,HemCombinedIncomeRange,3,TRUE),1)","v":1},null,{"$f":" IFERROR(HLOOKUP(K27+K35-K33,HemCombinedIncomeRange,3,TRUE),1)","v":1},null,{"$f":" IFERROR(HLOOKUP(M27+M35-M33,HemCombinedIncomeRange,3,TRUE),1)","v":1},null,{"$f":" IFERROR(HLOOKUP(O27+O35-O33,HemCombinedIncomeRange,3,TRUE),1)","v":1}]
[null,null,"Tax",null,{"$f":"IF(E15=\"Company\",E34*CompanyTax,INDEX(TaxForBracket,MATCH(E34,TaxBracketMin,1))+INDEX(TaxRate,MATCH(E34,TaxBracketMin,1))*(E34-INDEX(TaxBracketMin,MATCH(E34,TaxBracketMin,1)))+IF(E34<='Tax Table'!$B$6,0,IF(E34<='Tax Table'!$B$7,(E34-'Tax Table'!$B$6)*'Tax Table'!$C$6,E34*'Tax Table'!$C$7)))+(E23*CompanyTax)","v":0},null,{"$f":"IF(G15=\"Company\",G34*CompanyTax,INDEX(TaxForBracket,MATCH(G34,TaxBracketMin,1))+INDEX(TaxRate,MATCH(G34,TaxBracketMin,1))*(G34-INDEX(TaxBracketMin,MATCH(G34,TaxBracketMin,1)))+IF(G34<='Tax Table'!$B$6,0,IF(G34<='Tax Table'!$B$7,(G34-'Tax Table'!$B$6)*'Tax Table'!$C$6,G34*'Tax Table'!$C$7)))+(G23*CompanyTax)","v":0},null,{"$f":"IF(I15=\"Company\",I34*CompanyTax,INDEX(TaxForBracket,MATCH(I34,TaxBracketMin,1))+INDEX(TaxRate,MATCH(I34,TaxBracketMin,1))*(I34-INDEX(TaxBracketMin,MATCH(I34,TaxBracketMin,1)))+IF(I34<='Tax Table'!$B$6,0,IF(I34<='Tax Table'!$B$7,(I34-'Tax Table'!$B$6)*'Tax Table'!$C$6,I34*'Tax Table'!$C$7)))+(I23*CompanyTax)","v":0},null,{"$f":"IF(K15=\"Company\",K34*CompanyTax,INDEX(TaxForBracket,MATCH(K34,TaxBracketMin,1))+INDEX(TaxRate,MATCH(K34,TaxBracketMin,1))*(K34-INDEX(TaxBracketMin,MATCH(K34,TaxBracketMin,1)))+IF(K34<='Tax Table'!$B$6,0,IF(K34<='Tax Table'!$B$7,(K34-'Tax Table'!$B$6)*'Tax Table'!$C$6,K34*'Tax Table'!$C$7)))+(K23*CompanyTax)","v":0},null,{"$f":"IF(M15=\"Company\",M34*CompanyTax,INDEX(TaxForBracket,MATCH(M34,TaxBracketMin,1))+INDEX(TaxRate,MATCH(M34,TaxBracketMin,1))*(M34-INDEX(TaxBracketMin,MATCH(M34,TaxBracketMin,1)))+IF(M34<='Tax Table'!$B$6,0,IF(M34<='Tax Table'!$B$7,(M34-'Tax Table'!$B$6)*'Tax Table'!$C$6,M34*'Tax Table'!$C$7)))+(M23*CompanyTax)","v":0},null,{"$f":"IF(O15=\"Company\",O34*CompanyTax,INDEX(TaxForBracket,MATCH(O34,TaxBracketMin,1))+INDEX(TaxRate,MATCH(O34,TaxBracketMin,1))*(O34-INDEX(TaxBracketMin,MATCH(O34,TaxBracketMin,1)))+IF(O34<='Tax Table'!$B$6,0,IF(O34<='Tax Table'!$B$7,(O34-'Tax Table'!$B$6)*'Tax Table'!$C$6,O34*'Tax Table'!$C$7)))+(O23*CompanyTax)","v":0}]
[null,null,"Tax offset for Low Income Earners",null,{"$f":"0-(IF(OR(E15=\"Company\",E34=\"\",E34=0),0,IF(VLOOKUP(E34,TaxOffsetForLowIncomeTable,2,TRUE)+(E34-VLOOKUP(E34,TaxOffsetForLowIncomeTable,1,TRUE))*VLOOKUP(E34,TaxOffsetForLowIncomeTable,3,TRUE)<0,0,VLOOKUP(E34,TaxOffsetForLowIncomeTable,2,TRUE)+(E34-VLOOKUP(E34,TaxOffsetForLowIncomeTable,1,TRUE))*VLOOKUP(E34,TaxOffsetForLowIncomeTable,3,TRUE))))","v":0},null,{"$f":"0-(IF(OR(G15=\"Company\",G34=\"\",G34=0),0,IF(VLOOKUP(G34,TaxOffsetForLowIncomeTable,2,TRUE)+(G34-VLOOKUP(G34,TaxOffsetForLowIncomeTable,1,TRUE))*VLOOKUP(G34,TaxOffsetForLowIncomeTable,3,TRUE)<0,0,VLOOKUP(G34,TaxOffsetForLowIncomeTable,2,TRUE)+(G34-VLOOKUP(G34,TaxOffsetForLowIncomeTable,1,TRUE))*VLOOKUP(G34,TaxOffsetForLowIncomeTable,3,TRUE))))","v":0},null,{"$f":"0-(IF(OR(I15=\"Company\",I34=\"\",I34=0),0,IF(VLOOKUP(I34,TaxOffsetForLowIncomeTable,2,TRUE)+(I34-VLOOKUP(I34,TaxOffsetForLowIncomeTable,1,TRUE))*VLOOKUP(I34,TaxOffsetForLowIncomeTable,3,TRUE)<0,0,VLOOKUP(I34,TaxOffsetForLowIncomeTable,2,TRUE)+(I34-VLOOKUP(I34,TaxOffsetForLowIncomeTable,1,TRUE))*VLOOKUP(I34,TaxOffsetForLowIncomeTable,3,TRUE))))","v":0},null,{"$f":"0-(IF(OR(K15=\"Company\",K34=\"\",K34=0),0,IF(VLOOKUP(K34,TaxOffsetForLowIncomeTable,2,TRUE)+(K34-VLOOKUP(K34,TaxOffsetForLowIncomeTable,1,TRUE))*VLOOKUP(K34,TaxOffsetForLowIncomeTable,3,TRUE)<0,0,VLOOKUP(K34,TaxOffsetForLowIncomeTable,2,TRUE)+(K34-VLOOKUP(K34,TaxOffsetForLowIncomeTable,1,TRUE))*VLOOKUP(K34,TaxOffsetForLowIncomeTable,3,TRUE))))","v":0},null,{"$f":"0-(IF(OR(M15=\"Company\",M34=\"\",M34=0),0,IF(VLOOKUP(M34,TaxOffsetForLowIncomeTable,2,TRUE)+(M34-VLOOKUP(M34,TaxOffsetForLowIncomeTable,1,TRUE))*VLOOKUP(M34,TaxOffsetForLowIncomeTable,3,TRUE)<0,0,VLOOKUP(M34,TaxOffsetForLowIncomeTable,2,TRUE)+(M34-VLOOKUP(M34,TaxOffsetForLowIncomeTable,1,TRUE))*VLOOKUP(M34,TaxOffsetForLowIncomeTable,3,TRUE))))","v":0},null,{"$f":"0-(IF(OR(O15=\"Company\",O34=\"\",O34=0),0,IF(VLOOKUP(O34,TaxOffsetForLowIncomeTable,2,TRUE)+(O34-VLOOKUP(O34,TaxOffsetForLowIncomeTable,1,TRUE))*VLOOKUP(O34,TaxOffsetForLowIncomeTable,3,TRUE)<0,0,VLOOKUP(O34,TaxOffsetForLowIncomeTable,2,TRUE)+(O34-VLOOKUP(O34,TaxOffsetForLowIncomeTable,1,TRUE))*VLOOKUP(O34,TaxOffsetForLowIncomeTable,3,TRUE))))","v":0}]
[null,null,"Net",null,{"$f":"E27-(IF(E37+E38>0,E37+E38,0))","v":0},null,{"$f":"G27-(IF(G37+G38>0,G37+G38,0))","v":0},null,{"$f":"I27-(IF(I37+I38>0,I37+I38,0))","v":0},null,{"$f":"K27-(IF(K37+K38>0,K37+K38,0))","v":0},null,{"$f":"M27-(IF(M37+M38>0,M37+M38,0))","v":0},null,{"$f":"O27-(IF(O37+O38>0,O37+O38,0))","v":0},null,null,{"$f":"(E39+G39+I39+K39+M39+O39)","v":0}]
[null,null,"HEM Living Expense",null,{"$f":"IFERROR(IF(AND(E28,NOT(E32)),(VLOOKUP(E30,HemTableForExpenses,E36+1,FALSE) +(VLOOKUP(E31,HemTableForExpenses,E36+1,FALSE))*(E17+E29))*NumberOfWeeksInAYear,0),0)","v":0},null,{"$f":"IFERROR(IF(AND(G28,NOT(G32)),(VLOOKUP(G30,HemTableForExpenses,G36+1,FALSE) +(VLOOKUP(G31,HemTableForExpenses,G36+1,FALSE))*(G17+G29))*NumberOfWeeksInAYear,0),0)","v":0},null,{"$f":"IFERROR(IF(AND(I28,NOT(I32)),(VLOOKUP(I30,HemTableForExpenses,I36+1,FALSE) +(VLOOKUP(I31,HemTableForExpenses,I36+1,FALSE))*(I17+I29))*NumberOfWeeksInAYear,0),0)","v":0},null,{"$f":"IFERROR(IF(AND(K28,NOT(K32)),(VLOOKUP(K30,HemTableForExpenses,K36+1,FALSE) +(VLOOKUP(K31,HemTableForExpenses,K36+1,FALSE))*(K17+K29))*NumberOfWeeksInAYear,0),0)","v":0},null,{"$f":"IFERROR(IF(AND(M28,NOT(M32)),(VLOOKUP(M30,HemTableForExpenses,M36+1,FALSE) +(VLOOKUP(M31,HemTableForExpenses,M36+1,FALSE))*(M17+M29))*NumberOfWeeksInAYear,0),0)","v":0},null,{"$f":"IFERROR(IF(AND(O28,NOT(O32)),(VLOOKUP(O30,HemTableForExpenses,O36+1,FALSE) +(VLOOKUP(O31,HemTableForExpenses,O36+1,FALSE))*(O17+O29))*NumberOfWeeksInAYear,0),0)","v":0},null,null,0]
[null,null,"Expenses compared to HEM Annual",null,{"$f":"SUMIF($F$50:$F$65,\"Yes\",$G$50:$G$65)*12","v":0},null,"Expenses not compared to HEM Exc Inv Property Annual",null,null,null,{"$f":"SUMIF($F$50:$F$65,\"No\",$G$50:$G$65)*12-(G52*12)","v":0},null,"Customer Nominated Living Expenses",null,null,null,null,{"$f":"E41+K41+K42","v":0}]
[null,null,"Compared to HEM Percentage on Benchmark",null,{"$f":"IF(R40=0,0,E41/R40)","v":0},null,null,null,"Investment Property Costs >15% of rent Annual",null,{"$f":"MAX(0,(G52*12)-(R25*15%))","v":0},null,"Living Expenses Used",null,null,null,null,{"$f":"MAX(R40,E41)+K41+K42","v":0}]
[null,null,null,null,null,null,null,null,null,null,null,null,"Net Available Income",null,null,null,null,{"$f":"R39-R42","v":0}]
[]
[]
[]
[null,null,"Commitments"]
[]
[null,null,"Living Expenses:",null,null,"Compared To Hem","Per Month",null,"Other Commitments:",null,null,null,"Per Month"]
[null,null,"Primary residence utilities, rates & expenses",null,null,"Yes",null,null,"Rent/Board"]
[null,null,"Primary residence strata fees & land tax & FHB property tax",null,null,"No",null,null,"Total Credit Card Limit",null,null,null,null,34,{"$f":"TEXT(CreditCardCommitments,\"0.00%\")&\": \"&M51*CreditCardCommitments","v":"3.82%: 0"},null,null,{"$f":"M51*CreditCardCommitments","v":0}]
[null,null,"Investment property utilities, rates, strata fees & land tax",null,null,"No",null,null,"Other Mortgage Repayments"]
[null,null,"Telephone, internet, Pay TV & media streaming",null,null,"Yes",null,null,"Other Liabilities"]
[null,null,"Groceries",null,null,"Yes"]
[null,null,"Recreation & Entertainment",null,null,"Yes"]
[null,null,"Clothing & Personal Care",null,null,"Yes"]
[null,null,"Medical & Health",null,null,"Yes"]
[null,null,"Transport",null,null,"Yes",null,null,null,null,"The living expenses declared by the customer are at risk of being understated when compared to a living expense benchmark. A Level 5 Pepper DCA holder will be required to approve this application"]
[null,null,"Education – non Private schooling",null,null,"Yes"]
[null,null,"Education - Private schooling ",null,null,"No"]
[null,null,"Childcare",null,null,"Yes"]
[null,null,"Insurance - General Basic",null,null,"Yes"]
[null,null,"Insurance - Health, Sickness, Personal Accident & Life ",null,null,"No"]
[null,null,"Other Living Expenses",null,null,"No"]
[null,null,"Child & Spousal Maintenance ",null,null,"No"]
[]
[]
[null,null,"Results"]
[]
[null,null,"Actual Rate:",null,"Monthly",null,"Annual",null,"Assessment Rate:",null,null,null,"Monthly",null,"Annual"]
[null,null,"Total Income",null,{"$f":"G71/NumberOfMonthsInAYear","v":0},null,{"$f":"$R$27","v":0},null,null,null,"Total Income",null,{"$f":"O71/NumberOfMonthsInAYear","v":0},null,{"$f":"$R$27","v":0}]
[null,null,"Net Income",null,{"$f":"G72/NumberOfMonthsInAYear","v":0},null,{"$f":"$R$39","v":0},null,null,null,"Net Income",null,{"$f":"R39/NumberOfMonthsInAYear","v":0},null,{"$f":"$R$39","v":0}]
[null,null,"Living Costs",null,{"$f":"G73/NumberOfMonthsInAYear","v":0},null,{"$f":"$R$42","v":0},null,null,null,"Living Costs",null,{"$f":"O73/NumberOfMonthsInAYear","v":0},null,{"$f":"$R$42","v":0}]
[null,null,"Net Available Income",null,{"$f":"IFERROR(G74/NumberOfMonthsInAYear,0)","v":0},null,{"$f":"$G$72-$G$73","v":0},null,null,null,"Net Available Income",null,{"$f":"IFERROR(O74/NumberOfMonthsInAYear,0)","v":0},null,{"$f":"$O$72-$O$73","v":0}]
[null,null,"Proposed Repayments",null,{"$f":"IFERROR(-PMT(ResiInterestRate1/NumberOfMonthsInAYear,(ResiLoanTerm1-ResiLoanIOTerm1)*NumberOfMonthsInAYear,ResiNewLoanAmount1),0)+IFERROR(-PMT(ResiInterestRate2/NumberOfMonthsInAYear,(ResiLoanTerm2-ResiLoanIOTerm2)*NumberOfMonthsInAYear,ResiNewLoanAmount2),0)","v":0},null,{"$f":"E75*NumberOfMonthsInAYear","v":0},null,null,null,"Proposed Repayments",null,{"$f":"IFERROR(-PMT(ResiAssessmentRate1/NumberOfMonthsInAYear,(ResiLoanTerm1-ResiLoanIOTerm1)*NumberOfMonthsInAYear,ResiNewLoanAmount1),0)+IFERROR(-PMT(ResiAssessmentRate2/NumberOfMonthsInAYear,(ResiLoanTerm2-ResiLoanIOTerm2)*NumberOfMonthsInAYear,ResiNewLoanAmount2),0)","v":0},null,{"$f":"M75*NumberOfMonthsInAYear","v":0}]
[null,null,"Other Commitments",null,{"$f":"IFERROR(G76/NumberOfMonthsInAYear,0)","v":0},null,{"$f":"O76","v":0},null,null,null,"Other Commitments",null,{"$f":"IFERROR(O76/NumberOfMonthsInAYear,0)","v":0},null,{"$f":"($M$52*OtherMortgageRepaymentBuffer+$M$53+$R$51+$M$50)*NumberOfMonthsInAYear","v":0}]
[]
[null,null,"NSR:",null,{"$f":"IF(K83=\"INCOMPLETE\",0,IFERROR(ROUNDDOWN(G74/(G75+G76),2),0))","v":0},null,{"$f":"IF(OR(ResiCheckForCompleteness=\"INCOMPLETE\",ResiTotalIncome=0),\"INCOMPLETE\",IF(AND(IF(AND(ResiTotalUntaxedAvailableIncome<>0,ResiTotalUntaxedAvailableIncome/ResiTotalIncome>AllowableGovernmentAllowanceOverTotalIncomeLimitation),ResiActualNSR>=AcceptableNSRForGovernmentIncome,TRUE),(ResiActualNSR>=AcceptableNSRForAllOtherApplicants)),\"PASS\",\"FAIL\"))","v":"INCOMPLETE"},null,null,null,"NSR:",null,{"$f":"IF(K83=\"INCOMPLETE\",0,IFERROR(ROUNDDOWN(O74/(O75+O76),2),0))","v":0},null,{"$f":"IF(OR(ResiCheckForCompleteness=\"INCOMPLETE\",ResiTotalIncome=0),\"INCOMPLETE\",IF(AND(IF(AND(ResiTotalUntaxedAvailableIncome<>0,ResiTotalUntaxedAvailableIncome/ResiTotalIncome>AllowableGovernmentAllowanceOverTotalIncomeLimitation),ResiAssessmentNSR>=AcceptableNSRForGovernmentIncome,TRUE),(ResiAssessmentNSR>=AcceptableNSRForAllOtherApplicants)),\"PASS\",\"FAIL\"))","v":"INCOMPLETE"}]
[null,null,"DSR:",null,{"$f":"IF(K83=\"INCOMPLETE\",\"-\",IFERROR((G75+G76-(M50*12))/R27,\"-\"))","v":"-"},null,null,null,null,null,"DSR:",null,{"$f":"IF(K83=\"INCOMPLETE\",\"-\",IFERROR((O75 +O76-(M50*12))/R27,\"-\"))","v":"-"}]
[]
[]
[null,null,null,null,null,null,null,null,null,null,"Application Status"]
[null,null,null,null,null,null,null,null,null,null,{"$f":"IF(OR(ResiNewLoanTotalAmount=\"\",ResiWAVGInterestRate=\"\",ResiWAVGLoanTerm=\"\",E15=\"\",R27=0,E18<>\"\",G18<>\"\",I18<>\"\",K18<>\"\",M18<>\"\",O18<>\"\",M10<=I9,G50=\"\",G51=\"\",G52=\"\",G53=\"\",G54=\"\",G55=\"\",G56=\"\",G57=\"\",G58=\"\",G59=\"\",G60=\"\",G61=\"\",G62=\"\",G63=\"\",G64=\"\",G65=\"\"),\"INCOMPLETE\",\"COMPLETE\")","v":"INCOMPLETE"}]
[]
[null,null,null,null,null,null,"Eligible Loan Amount",null,null,null,null,null,{"$f":"IF(O78=\"INCOMPLETE\",O78,MAX(0,IF(O78=\"PASS\",ResiNewLoanTotalAmount,IFERROR(-PV(ResiWAVGAssessmentRate/12,(ResiWAVGLoanTerm-ResiWAVGLoanIOTerm)*12,ROUNDDOWN(((O74-(O76*(IF(AND(ResiTotalUntaxedAvailableIncome<>0,ResiTotalUntaxedAvailableIncome/ResiTotalIncome>AllowableGovernmentAllowanceOverTotalIncomeLimitation),AcceptableNSRForGovernmentIncome,AcceptableNSRForAllOtherApplicants))))/(NumberOfMonthsInAYear*(IF(AND(ResiTotalUntaxedAvailableIncome<>0,ResiTotalUntaxedAvailableIncome/ResiTotalIncome>AllowableGovernmentAllowanceOverTotalIncomeLimitation),AcceptableNSRForGovernmentIncome,AcceptableNSRForAllOtherApplicants)))),0),0),0))))","v":"INCOMPLETE"}]
[]
[null,null,null,null,null,null,"Maximum Serviceable Loan Amount",null,null,null,null,null,{"$f":"IF(O78=\"INCOMPLETE\",O78,MAX(0,IFERROR(-PV(ResiWAVGAssessmentRate/12,(ResiWAVGLoanTerm-ResiWAVGLoanIOTerm)*12,ROUNDDOWN(((O74-(O76*(IF(AND(ResiTotalUntaxedAvailableIncome<>0,ResiTotalUntaxedAvailableIncome/ResiTotalIncome>AllowableGovernmentAllowanceOverTotalIncomeLimitation),AcceptableNSRForGovernmentIncome,AcceptableNSRForAllOtherApplicants))))/(NumberOfMonthsInAYear*(IF(AND(ResiTotalUntaxedAvailableIncome<>0,ResiTotalUntaxedAvailableIncome/ResiTotalIncome>AllowableGovernmentAllowanceOverTotalIncomeLimitation),AcceptableNSRForGovernmentIncome,AcceptableNSRForAllOtherApplicants)))),0),0),0)))","v":"INCOMPLETE"}]
[null,null,"Net Service Ratio (NSR) Requirements (using Assessment Rate)"]
[null,null,"All applications: NSR must be ≥ 1.00 (1.25x where final LVR > 90%)"]
[null,null,"Where loan amount or borrower exposure is > $1.5m AND aggregate LVR > 70%: NSR must be ≥ 1.25\nApplicants with majority income as Government Allowances (eg. Pensions, Family Tax Benefits): NSR must be ≥ 1.25"]
[null,null,"\n1% Interest Rate Buffer Eligiblity Rules\nAllowed for the following transactions:\n- Purchase of an investment property OR\n- Interest rate is FIXED across the whole loan (cash out ≤ $20,000) OR\n- Refinance home loan & debt consolidation (cash out ≤ $20,000)",null,null,null,null,null,"\n\nThe following rules apply:\n- Maximum LVR is 80%, AND\n- Minimum Equifax Credit Bureau score is 700, AND \n- No RHI > 0 on all debts or default listings in the last 12 months & no unpaid default listings"]
[null,null,"Important Information:\nThis calculator is to be used as a guide only as to borrowing power based on the basic information provided. It is not an offer of credit or a quote.  Lending criteria, terms and conditions, fees and charges will apply should a borrower apply for credit.\nPepper Money Limited ABN 55 094 317 665 Australian credit licence 286655"]

{"sheet":"HEM Table","index":1,"n_rows":62,"n_cols":19,"rows_kept":62,"cut":false,"hidden":true,"merged":[]}
["Combined Couple Gross Income",null,{"$f":"B2","v":0},{"$f":"C2","v":25000},{"$f":"D2","v":37000},50000,62000,74000,99000,124000,149000,173000,198000,248000,309000,371000,null,null,"Higher income band used as data not available for income band"]
["HEM 2023Q2",null,25000,37000,50000,62000,74000,99000,124000,149000,173000,198000,248000,309000,371000,999999999]
[null,null,1,2,3,4,5,6,7,8,9,10,11,12,13,14]
["Pepper - Proposed"]
["Single","P-S",{"$f":"C25","v":286.55288614676402},303.59692074113838,317.37005088673737,337.08129732731436,375.64594817650641,431.28751941880444,510.8984894773975,584.8637194108984,672.84087544288809,716.71562723413217,765.07952136217421,891.08974066270764,1011.991526888846,1053.5571453582577]
["Couple","P-C",{"$f":"D6","v":562.57491210739261},{"$f":"D20","v":562.57491210739261},576.32779221134729,596.01007983038539,634.51808696467788,690.07794371814964,769.57192566567176,843.4285528078758,931.27645914098332,975.08678094072616,1023.3796140182511,1149.2046977166801,1269.9289259626166,1311.433487931226]
["Single parent with 1 child  (per child)","P-SD1",{"$f":"D7","v":101.24650284179558},{"$f":"IF(D26-D25<0,0,D26-D25)","v":101.24650284179558},101.22402036322904,101.19186661340888,101.12897208440529,101.038238839168,100.90834686366662,100.78775529182838,100.64424567733954,100.57266730389563,100.49382242096885,100.28831756015552,100.09112614446008,100.02333241364659]
["Single parent with 2 children  (per child)","P-SD2",107.43171759427085,{"$f":"IF(D27-D25<0,0,D27-D25)/2","v":107.43171759427085},107.40177635266045,107.35891545430394,107.27505218838843,107.15406570416314,106.98093345487607,106.82010575672041,106.62879456132617,106.53334971607728,106.42821652029517,106.15419113141996,105.89130188975412,105.80089676721468]
["Single parent with 3 children  (per child)","P-SD3",109.46102834913758,{"$f":"E9","v":109.46102834913758},{"$f":"IF(E28-E25<0,0,E28-E25)/3","v":109.46102834913758},109.41459840126898,109.3237455563828,109.19267465916153,109.00512898527921,108.83088924501776,108.62364418932172,108.52024385347113,108.40634788673724,108.10948232184141,107.82469380485213,107.72675155173738]
["Single parent with 4 or more children  (per child)","P-SD4+",109.46102834913758,109.46102834913758,{"$f":"IF(E28-E25<0,0,E28-E25)/3","v":109.46102834913758},109.41459840126898,109.3237455563828,109.19267465916153,109.00512898527921,108.83088924501776,108.62364418932172,108.52024385347113,108.40634788673724,108.10948232184141,107.82469380485213,107.72675155173738]
["Couple with 1 child (per child)","P-CD1",87.05253270615367,87.05253270615367,{"$f":"IF(E21-E20<0,0,E21-E20)","v":87.05253270615367},87.033900339804518,86.997528171532394,86.944982435231054,86.869840532259786,86.80002735427388,86.716988881521615,86.675558635261723,86.629928123492277,86.510991620388495,86.396876714795553,86.357644414539664]
["Couple with 2 children  (per child)","P-CD2",79.758975579174546,79.758975579174546,{"$f":"IF(E22-E20<0,0,E22-E20)/2","v":79.758975579174546},79.760849802974803,79.764512074541244,79.769784258507684,79.777381645702974,79.784405339734121,79.792779778842657,79.796905464725342,79.801550198637926,79.813531751346886,79.825027580806591,79.828979806247503]
["Couple with 3 children  (per child)","P-CD3",74.010069262353156,74.010069262353156,{"$f":"F13","v":74.010069262353156},{"$f":"IF(F23-F20<0,0,F23-F20)/3","v":74.010069262353156},74.033933622543984,74.068357561099148,74.117646766447933,74.163417284246478,74.217865818162679,74.245013498562074,74.274957931896282,74.352944893944894,74.427770322467197,74.453495039701309]
["Couple with 4 or more children  (per child)","P-CD4+",{"$f":"D14","v":74.010069262353156},{"$f":"E14","v":74.010069262353156},{"$f":"F14","v":74.010069262353156},{"$f":"IF(F23-F20<0,0,F23-F20)/3","v":74.010069262353156},74.033933622543984,74.068357561099148,74.117646766447933,74.163417284246478,74.217865818162679,74.245013498562074,74.274957931896282,74.352944893944894,74.427770322467197,74.453495039701309]
[]
[null,null,1,2,3,4,5,6,7,8,9,10,11,12,13,14]
[null,null,25000,25000,37000,50000,62000,74000,99000,124000,149000,173000,198000,248000,309000,371000]
[null,null,"or less","to","to","to","to","to","to","to","to","to","to","to","to","to"]
["Australia",null,null,37000,50000,62000,74000,99000,124000,149000,173000,198000,248000,309000,371000,619000]
["Couple",null,0,562.57491210739261,576.32779221134729,596.01007983038539,634.51808696467788,690.07794371814964,769.57192566567176,843.4285528078758,931.27645914098332,975.08678094072616,1023.3796140182511,1149.2046977166801,1269.9289259626166,1311.433487931226]
["Couple with 1 child",null,0,0,663.38032491750096,683.04398017018991,721.51561513621027,777.02292615338069,856.44176619793154,930.22858016214968,1017.9934480225049,1061.7623395759879,1110.0095421417434,1235.7156893370686,1356.3258026774122,1397.7911323457656]
["Couple with 2 children",null,0,0,735.84574336969638,755.531779436335,794.04711111376037,849.61751223516501,929.1266889570777,1002.997363487344,1090.8620186986686,1134.6805918701768,1182.982714415527,1308.8317612193739,1429.5789811242298,1471.091447543721]
["Couple with 3 or more children",null,0,0,0,818.04028761744485,856.61988783230981,912.28301640144707,991.92486596501556,1065.9188046606153,1153.9300565954713,1197.8218214364124,1246.20448781394,1372.2635323985148,1493.2122369300182,1534.7939730503299]
[]
["Single person",null,286.55288614676402,303.59692074113838,317.37005088673737,337.08129732731436,375.64594817650641,431.28751941880444,510.8984894773975,584.8637194108984,672.84087544288809,716.71562723413217,765.07952136217421,891.08974066270764,1011.991526888846,1053.5571453582577]
["Single parent with 1 child",null,0,404.84342358293395,418.59407124996642,438.27316394072324,476.7749202609117,532.32575825797244,611.80683634106413,685.65147470272677,773.48512112022763,817.2882945380278,865.57334378314306,991.37805822286316,1112.0826530333061,1153.5804777719043]
["Single parent with 2 children",null,0,518.46035592968008,532.17360359205827,551.79912823592224,590.19605255328327,645.59565082713073,724.86035638714964,798.50393092433922,886.09846456554044,929.78232666628674,977.93595440276454,1103.3981229255476,1223.7741306683542,1265.158938892687]
["Single parent with 3 or more children",null,0,0,645.75313593415012,665.3250925311213,703.61718484565483,758.86554339628901,837.91387643323515,911.35638714595166,998.71180801085325,1042.2763587945456,1090.2985650223859,1215.4181876282319,1335.4656083034024,1376.7374000134698]
[]
[]
[]
[]
[]
[]
[]
["Comparison to prior Benchmark version"]
[]
["HEM 2023Q1"]
[]
[null,null,25000,25000,37000,49000,61000,74000,98000,123000,147000,172000,196000,246000,307000,368000]
[null,null,"or less","to","to","to","to","to","to","to","to","to","to","to","to","to"]
["Australia",null,null,37000,49000,61000,74000,98000,123000,147000,172000,196000,246000,307000,368000,614000]
["Couple",null,0,553.28368370810654,567.65944127870807,588.24790794372473,626.23508682568411,681.14900853553115,756.98103315359322,828.73947398398207,915.1865124016341,960.44495623987518,1003.9880431092344,1126.1517492515811,1243.4384719356358,1287.6800804572717]
["Couple with 1 child",null,0,0,654.40754939073224,675.06831118834896,713.18888889462687,768.29559153128469,844.39393237470495,916.40431180869905,1003.1549036772694,1048.57226975347,1092.2682738612416,1214.8609319625486,1332.5594997493315,1376.9564599543419]
["Couple with 2 children",null,0,0,726.56289492519807,747.13349229300752,785.08770105628093,839.95392487994343,915.72013279549071,987.41632908016743,1073.7882645699988,1119.0075005209549,1162.5127768554557,1284.5703988810826,1401.755398351045,1445.958535199768]
["Couple with 3 or more children",null,0,0,0,805.73962637854822,844.00716648553123,899.32632563004722,975.71800381310152,1048.0060713330313,1135.091030202047,1180.683581455912,1224.5480054576321,1347.6132457289118,1465.7656017616428,1510.333721068858]
[]
["Single person",null,281.88967375827372,297.87697304376547,312.2425383027354,332.8163882392883,370.77660279558972,425.65150192223405,501.42968979126897,573.13723163665941,659.52284232324064,704.74917334028123,748.26136520166733,870.33832324444279,987.5418334047414,1031.7519595371839]
["Single parent with 1 child",null,0,398.19154942718183,412.55586067346457,433.12798398804131,471.08491329334549,525.95514615319064,601.72683058634061,673.4281812716406,759.80640689023812,805.02889853539864,848.53732476107632,970.60383894067218,1087.7972497308569,1132.0036601654074]
["Single parent with 2 children",null,0,510.53150034341115,524.93078756841169,545.5529000753869,583.60215791824737,638.6057837388106,714.56173367667452,786.43744274265623,873.02575362317316,918.3581958563135,961.97244119721074,1084.3357149295496,1201.8141818884669,1246.1280170657612]
["Single parent with 3 or more children",null,0,0,637.30571446335875,657.97781616273255,696.11940254314925,751.25642132443056,827.39663676700843,899.44670421367186,986.2451003561082,1031.6874931772284,1075.4075576333453,1198.067590918427,1315.8311140460769,1360.2523739661151]
[]
["CHANGE"]
["Couple",null,null,{"$f":"D20-D43","v":9.2912283992860694},8.6683509326392141,7.762171886660667,8.2830001389937706,8.9289351826184884,12.59089251207854,14.689078823893738,16.089946739349216,14.641824700850975,19.391570909016764,23.052948465099007,26.490454026980842,23.753407473954212]
["Couple with 1 child",null,null,null,{"$f":"E21-E44","v":8.9727755267687144},7.9756689818409541,8.3267262415834011,8.7273346220960093,12.047833823226597,13.824268353450634,14.838544345235505,13.190069822517899,17.741268280501799,20.854757374519977,23.766302928080677,20.834672391423737]
["Couple with 2 children",null,null,null,{"$f":"E22-E45","v":9.2828484444983133},8.3982871433274795,8.9594100574794311,9.6635873552215799,13.406556161586991,15.581034407176617,17.073754128669862,15.673091349221977,20.46993756007123,24.261362338291292,27.823582773184853,25.132912343952967]
["Couple with 3 or more children",null,null,null,null,{"$f":"F23-F46","v":12.300661238896623},12.612721346778585,12.956690771399849,16.206862151914038,17.912733327583965,18.839026393424319,17.13823998050043,21.656482356307833,24.65028666960302,27.446635168375451,24.460251981471856]
[]
["Single person",null,{"$f":"C25-C48","v":4.6632123884903081},5.719947697372902,5.1275125840019768,4.2649090880260587,4.869345380916684,5.6360174965703891,9.4687996861285342,11.72648777423899,13.318033119647453,11.966453893850939,16.818156160506874,20.75141741826485,24.449693484104614,21.805185821073792]
["Single parent with 1 child",null,null,{"$f":"D26-D49","v":6.6518741557521253},6.0382105765018537,5.1451799526819286,5.6900069675662053,6.3706121047817987,10.080005754723516,12.223293431086176,13.678714229989509,12.25939600262916,17.036019022066739,20.774219282190984,24.28540330244914,21.576817606496888]
["Single parent with 2 children",null,null,{"$f":"D27-D50","v":7.9288555862689236},7.2428160236465828,6.2462281605353382,6.5938946350358947,6.9898670883201248,10.298622710475115,12.066488181682985,13.07271094236728,11.424130809973235,15.963513205553795,19.062407995998001,21.959948779887327,19.030921826925805]
["Single parent with 3 or more children",null,null,null,{"$f":"E28-E51","v":8.4474214707913688},7.3472763683887479,7.4977823025055841,7.6091220718584509,10.517239666226715,11.909682932279793,12.466707654745051,10.588865617317197,14.891007389040624,17.350596709804904,19.634494257325514,16.485026047354722]

{"sheet":"TestCases","index":2,"n_rows":65,"n_cols":239,"rows_kept":65,"cut":false,"hidden":true,"merged":[[0,172,0,232],[0,0,0,110],[0,111,0,171]]}
["Test Cases TestCases TestCases TestCases TestCases TestCases TestCases TestCases TestCases TestCases TestCases TestCases TestCases TestCases TestCases TestCases TestCases TestCases TestCases TestCases TestCases TestCases TestCases TestCases TestCases TestCases TestCases TestCases TestCases  TestCases TestCases TestCases TestCases TestCases TestCases TestCases TestCases TestCases TestCases TestCases TestCases TestCases TestCases TestCases TestCases TestCases TestCases TestCases TestCases TestCases TestCases TestCases TestCases TestCases TestCases TestCases TestCases TestCases TestCases TestCases TestCases TestCases TestCases TestCases TestCases TestCases TestCases TestCases TestCases TestCases TestCases TestCases TestCases TestCases TestCases TestCases TestCases TestCases TestCases TestCases TestCases TestCases TestCases TestCases ",null,null,null,null,null,null,null,null,null,null,null,null,null,null,null,null,null,null,null,null,null,null,null,null,null,null,null,null,null,null,null,null,null,null,null,null,null,null,null,null,null,null,null,null,null,null,null,null,null,null,null,null,null,null,null,null,null,null,null,null,null,null,null,null,null,null,null,null,null,null,null,null,null,null,null,null,null,null,null,null,null,null,null,null,null,null,null,null,null,null,null,null,null,null,null,null,null,null,null,null,null,null,null,null,null,null,null,null,null,null,"Original-Result-set Original-Result-set Original-Result-set Original-Result-set Original-Result-set Original-Result-set Original-Result-set Original-Result-set Original-Result-set Original-Result-set Original-Result-set Original-Result-set Original-Result-set Original-Result-set Original-Result-set Original-Result-set Original-Result-set Original-Result-set Original-Result-set Original-Result-set Original-Result-set Original-Result-set Original-Result-set Original-Result-set Original-Result-set Original-Result-set Original-Result-set  Original-Result-set",null,null,null,null,null,null,null,null,null,null,null,null,null,null,null,null,null,null,null,null,null,null,null,null,null,null,null,null,null,null,null,null,null,null,null,null,null,null,null,null,null,null,null,null,null,null,null,null,null,null,null,null,null,null,null,null,null,null,null,null,"New-Resultset New-Resultset New-Resultset New-Resultset New-Resultset New-Resultset New-Resultset New-Resultset New-Resultset New-Resultset New-Resultset New-Resultset New-Resultset New-Resultset New-Resultset New-Resultset New-Resultset New-Resultset New-Resultset New-Resultset New-Resultset New-Resultset New-Resultset New-Resultset New-Resultset New-Resultset New-Resultset New-Resultset New-Resultset New-Resultset New-Resultset New-Resultset New-Resultset New-Resultset New-Resultset New-Resultset New-Resultset New-Resultset ",null,null,null,null,null,null,null,null,null,null,null,null,null,null,null,null,null,null,null,null,null,null,null,null,null,null,null,null,null,null,null,null,null,null,null,null,null,null,null,null,null,null,null,null,null,null,null,null,null,null,null,null,null,null,null,null,null,null,null,null,"Test cases will run when date tested is blank and Run Scenario Flag is \"Y\""]
["Total Loan Amount","WAVG Interest Rate","WAVG Assessment Rate","Max Loan Term","Max IO Term","Loan Amount 1","Interest Rate 1","Assessement Rate 1","Loan Term 1","IO Term 1","Loan Amount 2","Interest Rate 2","Assessment Rate 2","Loan Term 2","IO Term 2","Status 1","Status 2","Status 3","Status 4","Status 5","Status 6","Couple With 1","Couple With 2","Couple With 3","Couple With 4","Couple With 5","Couple With 6","Dependants 1","Dependants 2","Dependants 3","Dependants 4","Dependants 5","Dependants 6","Gross Annual Income 1","Gross Annual Income 2","Gross Annual Income 3","Gross Annual Income 4","Gross Annual Income 5","Gross Annual Income 6","Untaxed Income 1","Untaxed Income 2","Untaxed Income 3","Untaxed Income 4","Untaxed Income 5","Untaxed Income 6","SEIC 1","SEIC 2","SEIC 3","SEIC 4","SEIC 5","SEIC 6","Add Backs 1","Add Backs 2","Add Backs 3","Add Backs 4","Add Backs 5","Add Backs 6","NPBT 1","NPBT 2","NPBT 3","NPBT 4","NPBT 5","NPBT 6","Gross Rental Income 1","Gross Rental Income 2","Gross Rental Income 3","Gross Rental Income 4","Gross Rental Income 5","Gross Rental Income 6","Investment Property Loan Balance 1","Investment Property Loan Balance 2","Investment Property Loan Balance 3","Investment Property Loan Balance 4","Investment Property Loan Balance 5","Investment Property Loan Balance 6","Owner occupied property utilities, rates & costs","Rented property costs","Investment property utilities, rates & costs","Telephone, Internet, Pay TV & Media Streaming","Groceries","Recreation & Entertainment","Clothing & Personal Care","Medical & Health","Transport","Education – non Private schooling","Education - Private schooling ","Childcare","Insurance - General Basic","Insurance - Health, Sickness and Personal Accident, Life ","Other Living Expenses","Child and Spousal Maintenance ","Owner occupied property utilities, rates & costs","Rented property costs","Investment property utilities, rates & costs","Telephone, Internet, Pay TV & Media Streaming","Groceries","Recreation & Entertainment","Clothing & Personal Care","Medical & Health","Transport","Education – non Private schooling","Education - Private schooling ","Childcare","Insurance - General Basic","Insurance - Health, Sickness and Personal Accident, Life ","Other Living Expenses","Child and Spousal Maintenance ","Rent/Board","Total Credit Card Limit","Other Mortgage Repayments","Other Liabilities","Tax Applicant 1","Tax Applicant 2","Tax Applicant 3","Tax Applicant 4","Tax Applicant 5","Tax Applicant 6","Net Income Applicant 1","Net Income Applicant 2","Net Income Applicant 3","Net Income Applicant 4","Net Income Applicant 5","Net Income Applicant 6","Net Income Total","Hem Living Expense Applicant 1","Hem Living Expense Applicant 2","Hem Living Expense Applicant 3","Hem Living Expense Applicant 4","Hem Living Expense Applicant 5","Hem Living Expense Applicant 6","Hem Living Expense Total","Customer Nominated Living Expenses","Living Expense Used","Net Available Income","Baseline Assessment Rate","Assessment Loading","Credit Card Commitments","Workings for Negative Gearing","Other Mortgage Repayment Buffer","Rental Income Shading","Company Tax","Actual Rate Monthly Total Income","Actual Rate Monthly - Net Income","Actual Rate Monthly - Living Costs","Actual Rate Monthly - Net Available Income","Actual Rate Monthly - Proposed Repayments","Actual Rate Monthly - Other Commitments","Actual Rate Annually Total Income","Actual Rate Annually - Net Income","Actual Rate Annually - Living Costs","Actual Rate Annually - Net Available Income","Actual Rate Annually - Proposed Repayments","Actual Rate Annually - Other Commitments","Assessment Rate Monthly Total Income","Assessment Rate Monthly - Net Income","Assessment Rate Monthly - Living Costs","Assessment Rate Monthly - Net Available Income","Assessment Rate Monthly - Proposed Repayments","Assessment Rate Monthly - Other Commitments","Assessment Rate Annually Total Income","Assessment Rate Annually - Net Income","Assessment Rate Annually - Living Costs","Assessment Rate Annually - Net Available Income","Assessment Rate Annually - Proposed Repayments","Assessment Rate Annually - Other Commitments","Actual NSR","Actual DSR","Actual Results","Assessment NSR","Assessment DSR","Assessment Results","Eligible Loan Amount","Tax Applicant 1","Tax Applicant 2","Tax Applicant 3","Tax Applicant 4","Tax Applicant 5","Tax Applicant 6","Net Income Applicant 1","Net Income Applicant 2","Net Income Applicant 3","Net Income Applicant 4","Net Income Applicant 5","Net Income Applicant 6","Net Income Total","Hem Living Expense Applicant 1","Hem Living Expense Applicant 2","Hem Living Expense Applicant 3","Hem Living Expense Applicant 4","Hem Living Expense Applicant 5","Hem Living Expense Applicant 6","Hem Living Expense Total","Customer Nominated Living Expenses","Living Expense Used","Net Available Income","Baseline Assessment Rate","Assessment Loading","Credit Card Commitments","Workings for Negative Gearing","Other Mortgage Repayment Buffer","Rental Income Shading","Company Tax","Actual Rate Monthly Total Income","Actual Rate Monthly - Net Income","Actual Rate Monthly - Living Costs","Actual Rate Monthly - Net Available Income","Actual Rate Monthly - Proposed Repayments","Actual Rate Monthly - Other Commitments","Actual Rate Annually Total Income","Actual Rate Annually - Net Income","Actual Rate Annually - Living Costs","Actual Rate Annually - Net Available Income","Actual Rate Annually - Proposed Repayments","Actual Rate Annually - Other Commitments","Assessment Rate Monthly Total Income","Assessment Rate Monthly - Net Income","Assessment Rate Monthly - Living Costs","Assessment Rate Monthly - Net Available Income","Assessment Rate Monthly - Proposed Repayments","Assessment Rate Monthly - Other Commitments","Assessment Rate Annually Total Income","Assessment Rate Annually - Net Income","Assessment Rate Annually - Living Costs","Assessment Rate Annually - Net Available Income","Assessment Rate Annually - Proposed Repayments","Assessment Rate Annually - Other Commitments","Actual NSR","Actual DSR","Actual Results","Assessment NSR","Assessment DSR","Assessment Results","Eligible Loan Amount","Pass or Fail","Run Scenario Flag","Date Tested","Scenario","Sequence","Name "]
[1000000,0.06,8.4999999999999992E-2,30,5,1000000,0.06,8.4999999999999992E-2,30,5,null,null,null,null,null,"Individual (Couple)","Individual (Couple)",null,null,null,null,"Applicant 2","Applicant 1",null,null,null,null,2,null,null,null,null,null,270000,0,0,0,0,0,0,0,0,0,0,0,135000,0,0,0,0,0,0,0,0,0,0,0,100000,0,0,0,0,0,0,100000,0,0,0,0,0,300000,0,0,0,0,100,0,100,80,300,80,30,50,50,50,0,0,0,0,0,0,"Yes","No","No","Yes","Yes","Yes","Yes","Yes","Yes","Yes","No","Yes","Yes","No","No","No",0,5000,1000,500,186017,11401.6,0,0,0,0,318983,68688.2,0,0,0,0,387671.2,76496.759999999995,0,0,0,0,0,76496.759999999995,8880,76496.759999999995,311174.44,5.5E-2,0.02,3.8199999999999998E-2,6.0400000000000002E-2,1.25,0.8,0.25,48750,32305.93,6374.73,25931.200000000001,6443.01,1191,585000,387671.2,76496.759999999995,311174.44,77316.17,14292,48750,32305.93,6374.73,25931.200000000001,7718.16,1191,585000,387671.2,76496.759999999995,311174.44,92617.95,14292,3.39,0.15659515927907869,"PASS",2.91,0.18275204499959036,"PASS",1000000,186017,11401.6,0,0,0,0,318983,68688.2,0,0,0,0,387671.2,76496.759999999995,0,0,0,0,0,76496.759999999995,8880,76496.759999999995,311174.44,5.5E-2,0.02,3.8199999999999998E-2,6.0400000000000002E-2,1.25,0.8,0.25,48750,32305.93,6374.73,25931.200000000001,6443.01,1191,585000,387671.2,76496.759999999995,311174.44,77316.17,14292,48750,32305.93,6374.73,25931.200000000001,7718.16,1191,585000,387671.2,76496.759999999995,311174.44,92617.95,14292,3.39,0.15659515927907869,"PASS",2.91,0.18275204499959036,"PASS",1000000,{"$f":"IF(AND(DH3=FQ3,DI3=FR3,DJ3=FS3,DK3=FT3,DL3=FU3,DM3=FV3,DN3=FW3,DO3=FX3,DP3=FY3,DQ3=FZ3,DR3=GA3,DS3=GB3,DT3=GC3,DU3=GD3,DV3=GE3,DW3=GF3,DX3=GG3,DY3=GH3,DZ3=GI3,EA3=GJ3,EB3=GK3,EC3=GL3,ED3=GM3,EE3=GN3,EF3=GO3,EG3=GP3,EH3=GQ3,EI3=GR3,EJ3=GS3,EK3=GT3,EL3=GU3,EM3=GV3,EN3=GW3,EO3=GX3,EP3=GY3,EQ3=GZ3,ER3=HA3,ES3=HB3,ET3=HC3,EU3=HD3,EV3=HE3,EW3=HF3,EX3=HG3,EY3=HH3,EZ3=HI3,FA3=HJ3,FB3=HK3,FC3=HL3,FD3=HM3,FE3=HN3,FF3=HO3,FG3=HP3,FH3=HQ3,FI3=HR3,FJ3=HS3,FK3=HT3,FL3=HU3,FM3=HV3,FN3=HW3,FO3=HX3,FP3=HY3),\"Pass\",\"Fail\")","v":"Pass"},"Y","2023-10-25T09:21:52",null,"Case 1","Neil "]
[1000000,0.06,8.4999999999999992E-2,25,0,1000000,0.06,8.4999999999999992E-2,25,0,null,null,null,null,null,"Individual (Couple)","Individual (Couple)",null,null,null,null,"Applicant 2","Applicant 1",null,null,null,null,2,null,null,null,null,null,260000,0,0,0,0,0,0,0,0,0,0,0,135000,0,0,0,0,0,0,0,0,0,0,0,0,0,0,0,0,0,0,100000,0,0,0,0,0,0,0,0,0,0,0,0,0,0,0,0,0,0,0,0,0,2000,0,0,0,0,"Yes","No","No","Yes","Yes","Yes","Yes","Yes","Yes","Yes","No","Yes","Yes","No","No","No",0,5000,1000,500,156317,18067,0,0,0,0,238683,61933,0,0,0,0,300616,76496.759999999995,0,0,0,0,0,76496.759999999995,24000,76496.759999999995,224119.24,5.5E-2,0.02,3.8199999999999998E-2,6.0400000000000002E-2,1.25,0.8,0.25,39583.33,25051.33,6374.73,18676.599999999999,6443.01,1191,475000,300616,76496.759999999995,224119.24,77316.17,14292,39583.33,25051.33,6374.73,18676.599999999999,7718.16,1191,475000,300616,76496.759999999995,224119.24,92617.95,14292,2.44,0.19285930142791793,"PASS",2.09,0.22507357121002181,"PASS",1000000,156317,18067,0,0,0,0,238683,61933,0,0,0,0,300616,76496.759999999995,0,0,0,0,0,76496.759999999995,24000,76496.759999999995,224119.24,5.5E-2,0.02,3.8199999999999998E-2,6.0400000000000002E-2,1.25,0.8,0.25,39583.33,25051.33,6374.73,18676.599999999999,6443.01,1191,475000,300616,76496.759999999995,224119.24,77316.17,14292,39583.33,25051.33,6374.73,18676.599999999999,7718.16,1191,475000,300616,76496.759999999995,224119.24,92617.95,14292,2.44,0.19285930142791793,"PASS",2.09,0.22507357121002181,"PASS",1000000,"Pass","Y","2023-10-25T09:21:55",null,"Case 2","Neil "]
[1000000,0.04,6.5000000000000002E-2,31,0,1000000,0.04,6.5000000000000002E-2,31,0,null,null,null,null,null,"Individual (Couple)","Individual (Couple)",null,null,null,null,"Applicant 2","Applicant 1",null,null,null,null,2,null,null,null,null,null,260000,0,0,0,0,0,0,0,0,0,0,0,135000,0,0,0,0,0,0,0,0,0,0,0,0,0,0,0,0,0,0,100000,0,0,0,0,0,1000000,0,0,0,0,500,0,300,300,1200,1500,1200,500,400,500,0,0,500,0,0,0,"Yes","No","No","Yes","Yes","Yes","Yes","Yes","Yes","Yes","No","Yes","Yes","No","No","No",0,5000,10000,500,156317,0,0,0,0,0,238683,80000,0,0,0,0,318683,76496.759999999995,0,0,0,0,0,76496.759999999995,79200,79200,239483,5.5E-2,0.02,3.8199999999999998E-2,6.0400000000000002E-2,1.25,0.8,0.25,39583.33,26556.92,6600,19956.919999999998,4694.71,10191,475000,318683,79200,239483,56336.57,122292,39583.33,26556.92,6600,19956.919999999998,5926.95,10191,475000,318683,79200,239483,71123.399999999994,122292,1.34,0.37606013829451995,"PASS",1.23,0.40719031459572574,"PASS",1000000,156317,0,0,0,0,0,238683,80000,0,0,0,0,318683,76496.759999999995,0,0,0,0,0,76496.759999999995,79200,79200,239483,5.5E-2,0.02,3.8199999999999998E-2,6.0400000000000002E-2,1.25,0.8,0.25,39583.33,26556.92,6600,19956.919999999998,4694.71,10191,475000,318683,79200,239483,56336.57,122292,39583.33,26556.92,6600,19956.919999999998,5926.95,10191,475000,318683,79200,239483,71123.399999999994,122292,1.34,0.37606013829451995,"PASS",1.23,0.40719031459572574,"PASS",1000000,"Pass","Y","2023-10-25T09:21:57",null,"Case 3","Neil "]
[2000000,0.05,7.5000000000000011E-2,25,1,2000000,0.05,7.5000000000000011E-2,25,1,null,null,null,null,null,"Individual (Single)","Individual (Couple)","Individual (Single)",null,null,null,null,"Non-loan Party",null,null,null,null,null,null,3,null,null,null,80000,100000,120000,0,0,0,0,0,0,0,0,0,0,0,0,0,0,0,0,0,0,0,0,0,0,0,0,0,0,0,0,0,0,0,0,0,0,0,0,0,0,0,0,0,0,0,0,0,0,0,0,0,0,0,0,0,0,0,"Yes","No","No","Yes","Yes","Yes","Yes","Yes","Yes","Yes","No","Yes","Yes","No","No","No",0,0,0,0,18067,24967,31867,0,0,0,61933,75033,88133,0,0,0,225099,22426.95,40017.74,43571.519999999997,0,0,0,106016.21,0,106016.21,119082.79,5.5E-2,0.02,3.8199999999999998E-2,6.0400000000000002E-2,1.25,0.8,0.25,25000,18758.25,8834.68,9923.57,11937.95,0,300000,225099,106016.21,119082.79,143255.4,0,25000,18758.25,8834.68,9923.57,14355.19,0,300000,225099,106016.21,119082.79,172262.3,0,0.83,0.4775180097758896,"FAIL",0.69,0.57420766358740138,"FAIL",1382496.35,18067,24967,31867,0,0,0,61933,75033,88133,0,0,0,225099,22426.95,40017.74,43571.519999999997,0,0,0,106016.21,0,106016.21,119082.79,5.5E-2,0.02,3.8199999999999998E-2,6.0400000000000002E-2,1.25,0.8,0.25,25000,18758.25,8834.68,9923.57,11937.95,0,300000,225099,106016.21,119082.79,143255.4,0,25000,18758.25,8834.68,9923.57,14355.19,0,300000,225099,106016.21,119082.79,172262.3,0,0.83,0.4775180097758896,"FAIL",0.69,0.57420766358740138,"FAIL",1382496.35,"Pass","Y","2023-10-25T09:22:01",null,"Case 4","Neil "]
[1000000,0.04,6.5000000000000002E-2,25,0,1000000,0.04,6.5000000000000002E-2,25,0,null,null,null,null,null,"Individual (Single)","Individual (Single)","Individual (Single)","Individual (Single)","Individual (Single)","Individual (Single)",null,null,null,null,null,null,null,null,null,null,null,null,18200,22000,30000,40000,95000,190000,0,0,0,0,0,0,0,0,0,0,0,0,0,0,0,0,0,0,0,0,0,0,0,0,0,0,0,0,0,0,0,0,0,0,0,0,0,0,0,0,0,0,0,0,0,0,0,0,0,0,0,0,"Yes","No","No","Yes","Yes","Yes","Yes","Yes","Yes","Yes","No","Yes","Yes","No","No","No",0,0,0,0,0,722,2842,4942,23242,59967,18200,21978,27858,35633,71758,130033,305460,14900.75,14900.75,15787.04,16503.240000000002,22426.95,37269.21,121787.95,0,121787.95,183672.05,5.5E-2,0.02,3.8199999999999998E-2,6.0400000000000002E-2,1.25,0.8,0.25,32933.33,25455,10149,15306,5278.37,0,395200,305460,121787.95,183672.05,63340.42,0,32933.33,25455,10149,15306,6443.01,0,395200,305460,121787.95,183672.05,77316.17,0,2.89,0.16027434421997289,"PASS",2.37,0.19563807737414227,"PASS",1000000,0,722,2842,4942,23242,59967,18200,21978,27858,35633,71758,130033,305460,14900.75,14900.75,15787.04,16503.240000000002,22426.95,37269.21,121787.95,0,121787.95,183672.05,5.5E-2,0.02,3.8199999999999998E-2,6.0400000000000002E-2,1.25,0.8,0.25,32933.33,25455,10149,15306,5278.37,0,395200,305460,121787.95,183672.05,63340.42,0,32933.33,25455,10149,15306,6443.01,0,395200,305460,121787.95,183672.05,77316.17,0,2.89,0.16027434421997289,"PASS",2.37,0.19563807737414227,"PASS",1000000,"Pass","Y","2023-10-25T09:22:05",null,"Case 5","Neil "]
[2500000,6.7900000000000002E-2,9.290000000000001E-2,40,5,2500000,6.7900000000000002E-2,9.290000000000001E-2,40,5,null,null,null,null,null,"Company","Individual (Single)","Individual (Couple)","Individual (Couple)","Individual (Couple)","Individual (Single)","","","Non-loan Party","Applicant 5","Applicant 4","","","","","","","",0,0,80000,30000,40000,1,0,0,0,0,0,0,0,150000,0,0,0,0,75000,0,0,0,0,0,535000,0,0,0,0,0,0,0,0,50000,50000,0,0,0,0,1000000,1000000,0,0,0,0,0,0,0,0,0,0,0,0,20000,0,0,0,0,"Yes","No","No","Yes","Yes","Yes","Yes","Yes","Yes","Yes","No","Yes","Yes","No","No","No",0,50000,15000,0,133750,43567,18067,0,266,0,476250,106433,61933,70000,80000,1,794617,0,34987.730000000003,35884.050000000003,29253.9,0,14900.75,115026.42,240000,240000,554617,5.5E-2,0.02,3.8199999999999998E-2,6.0400000000000002E-2,1.25,0.8,0.25,82500.08,66218.080000000002,20000,46218.080000000002,15604.88,16910,990001,794617,240000,554617,187258.53,202920,82500.08,66218.080000000002,20000,46218.080000000002,19208.39,16910,990001,794617,240000,554617,230500.65,202920,1.42,0.39411933392930559,"PASS",1.27,0.43779819895527072,"PASS",2500000,133750,43567,18067,0,266,0,476250,106433,61933,70000,80000,1,794617,0,34987.730000000003,35884.050000000003,29253.9,0,14900.75,115026.42,240000,240000,554617,5.5E-2,0.02,3.8199999999999998E-2,6.0400000000000002E-2,1.25,0.8,0.25,82500.08,66218.080000000002,20000,46218.080000000002,15604.88,16910,990001,794617,240000,554617,187258.53,202920,82500.08,66218.080000000002,20000,46218.080000000002,19208.39,16910,990001,794617,240000,554617,230500.65,202920,1.42,0.39411933392930559,"PASS",1.27,0.43779819895527072,"PASS",2500000,"Pass","Y","2023-10-25T09:22:09",null,"Case 6","Neil "]
[2000000,5.2900000000000003E-2,7.7899999999999997E-2,30,3,2000000,5.2900000000000003E-2,7.7899999999999997E-2,30,3,null,null,null,null,null,"Company","Individual (Single)",null,null,null,null,null,null,null,null,null,null,null,null,null,null,null,null,0,1,0,0,0,0,0,30000,0,0,0,0,0,0,0,0,0,0,0,0,0,0,0,0,300000,0,0,0,0,0,0,0,0,0,0,0,0,0,0,0,0,0,0,0,0,0,0,0,0,0,0,0,0,0,0,0,0,0,"Yes","No","No","Yes","Yes","Yes","Yes","Yes","Yes","Yes","No","Yes","Yes","No","No","No",0,0,0,0,75000,0,0,0,0,0,225000,30001,0,0,0,0,255001,0,15787.04,0,0,0,0,15787.04,0,15787.04,239213.96,5.5E-2,0.02,3.8199999999999998E-2,6.0400000000000002E-2,1.25,0.8,0.25,27500.080000000002,21250.080000000002,1315.59,19934.5,11608.05,0,330001,255001,15787.04,239213.96,139296.62,0,27500.080000000002,21250.080000000002,1315.59,19934.5,14136.59,0,330001,255001,15787.04,239213.96,169639.12,0,1.71,0.42210969960880051,"PASS",1.41,0.51405638464231895,"PASS",2000000,75000,0,0,0,0,0,225000,30001,0,0,0,0,255001,0,15787.04,0,0,0,0,15787.04,0,15787.04,239213.96,5.5E-2,0.02,3.8199999999999998E-2,6.0400000000000002E-2,1.25,0.8,0.25,27500.080000000002,21250.080000000002,1315.59,19934.5,11608.05,0,330001,255001,15787.04,239213.96,139296.62,0,27500.080000000002,21250.080000000002,1315.59,19934.5,14136.59,0,330001,255001,15787.04,239213.96,169639.12,0,1.71,0.42210969960880051,"PASS",1.41,0.51405638464231895,"PASS",2000000,"Pass","Y","2023-10-25T09:22:14",null,"Case 7","Neil "]
[350000,0.06,8.4999999999999992E-2,12,5,350000,0.06,8.4999999999999992E-2,12,5,null,null,null,null,null,"Individual (Couple)","Individual (Couple)","","","","","Applicant 2","Applicant 1","","","","",3,2,"","","","",100000,80000,0,0,0,0,0,1,0,0,0,0,0,25000,0,0,0,0,0,0,0,0,0,0,0,0,0,0,0,0,0,0,0,0,0,0,0,0,0,0,0,0,0,0,0,0,0,0,0,0,0,0,0,0,0,0,0,0,"Yes","No","No","Yes","Yes","Yes","Yes","Yes","Yes","Yes","No","Yes","Yes","No","No","No",0,30000,500,0,24967,26692,0,0,0,0,75033,78309,0,0,0,0,153342,72527.23,0,0,0,0,0,72527.23,0,72527.23,80814.77,5.5E-2,0.02,3.8199999999999998E-2,6.0400000000000002E-2,1.25,0.8,0.25,17083.419999999998,12778.5,6043.94,6734.56,5112.99,1646,205001,153342,72527.23,80814.77,61355.93,19752,17083.419999999998,12778.5,6043.94,6734.56,5455.18,1646,205001,153342,72527.23,80814.77,65462.1,19752,0.99,0.39564650334329743,"FAIL",0.94,0.41567651129122329,"FAIL",326442.32,24967,26692,0,0,0,0,75033,78309,0,0,0,0,153342,72527.23,0,0,0,0,0,72527.23,0,72527.23,80814.77,5.5E-2,0.02,3.8199999999999998E-2,6.0400000000000002E-2,1.25,0.8,0.25,17083.419999999998,12778.5,6043.94,6734.56,5112.99,1646,205001,153342,72527.23,80814.77,61355.93,19752,17083.419999999998,12778.5,6043.94,6734.56,5455.18,1646,205001,153342,72527.23,80814.77,65462.1,19752,0.99,0.39564650334329743,"FAIL",0.94,0.41567651129122329,"FAIL",326442.32,"Pass","Y","2023-10-25T09:22:18",null,"Case 8","Neil "]
[350000,0.06,8.4999999999999992E-2,12,5,350000,0.06,8.4999999999999992E-2,12,5,null,null,null,null,null,"Individual (Couple)","Individual (Couple)","","","","","Applicant 2","Applicant 1","","","","",3,2,"","","","",100000,80000,0,0,0,0,0,0,0,0,0,0,0,25000,0,0,0,0,0,0,0,0,0,0,0,0,0,0,0,0,0,0,0,0,0,0,0,0,0,0,0,0,0,0,0,0,0,0,0,0,0,0,0,0,0,0,0,0,"Yes","No","No","Yes","Yes","Yes","Yes","Yes","Yes","Yes","No","Yes","Yes","No","No","No",0,30000,500,0,24967,26692,0,0,0,0,75033,78308,0,0,0,0,153341,72527.23,0,0,0,0,0,72527.23,0,72527.23,80813.77,5.5E-2,0.02,3.8199999999999998E-2,6.0400000000000002E-2,1.25,0.8,0.25,17083.330000000002,12778.42,6043.94,6734.48,5112.99,1646,205000,153341,72527.23,80813.77,61355.93,19752,17083.330000000002,12778.42,6043.94,6734.48,5455.18,1646,205000,153341,72527.23,80813.77,65462.1,19752,0.99,0.39564843332624056,"FAIL",0.94,0.41567853898152229,"FAIL",326442.32,24967,26692,0,0,0,0,75033,78308,0,0,0,0,153341,72527.23,0,0,0,0,0,72527.23,0,72527.23,80813.77,5.5E-2,0.02,3.8199999999999998E-2,6.0400000000000002E-2,1.25,0.8,0.25,17083.330000000002,12778.42,6043.94,6734.48,5112.99,1646,205000,153341,72527.23,80813.77,61355.93,19752,17083.330000000002,12778.42,6043.94,6734.48,5455.18,1646,205000,153341,72527.23,80813.77,65462.1,19752,0.99,0.39564843332624056,"FAIL",0.94,0.41567853898152229,"FAIL",326442.32,"Pass","Y","2023-10-25T09:22:20",null,"Case 9","Neil "]
[500000,7.0000000000000007E-2,9.5000000000000001E-2,20,3,500000,7.0000000000000007E-2,9.5000000000000001E-2,20,3,null,null,null,null,null,"Individual (Couple)","Individual (Couple)",null,null,null,null,"Applicant 2","Applicant 1",null,null,null,null,2,null,null,null,null,null,150000,0,0,0,0,0,0,0,0,0,0,0,0,0,0,0,0,0,0,0,0,0,0,0,0,0,0,0,0,0,20000,0,0,0,0,0,0,0,0,0,0,0,4000,0,0,0,0,0,0,0,0,0,0,0,0,0,0,0,"Yes","No","No","Yes","Yes","Yes","Yes","Yes","Yes","Yes","No","Yes","Yes","No","No","No",0,0,0,0,49807,0,0,0,0,0,116193,0,0,0,0,0,116193,56724.83,0,0,0,0,0,56724.83,48000,56724.83,59468.18,5.5E-2,0.02,3.8199999999999998E-2,6.0400000000000002E-2,1.25,0.8,0.25,13833.33,9682.75,4727.07,4955.68,4198.3,0,166000,116193,56724.83,59468.18,50379.64,0,13833.33,9682.75,4727.07,4955.68,4794.0200000000004,0,166000,116193,56724.83,59468.18,57528.23,0,1.18,0.30349180227473499,"PASS",1.03,0.34655562737885331,"PASS",500000,49807,0,0,0,0,0,116193,0,0,0,0,0,116193,56724.83,0,0,0,0,0,56724.83,48000,56724.83,59468.18,5.5E-2,0.02,3.8199999999999998E-2,6.0400000000000002E-2,1.25,0.8,0.25,13833.33,9682.75,4727.07,4955.68,4198.3,0,166000,116193,56724.83,59468.18,50379.64,0,13833.33,9682.75,4727.07,4955.68,4794.0200000000004,0,166000,116193,56724.83,59468.18,57528.23,0,1.18,0.30349180227473499,"PASS",1.03,0.34655562737885331,"PASS",500000,"Pass","Y","2023-10-25T09:22:23",null,"Case 10","Neil "]
[500000,7.0000000000000007E-2,9.5000000000000001E-2,20,3,500000,7.0000000000000007E-2,9.5000000000000001E-2,20,3,null,null,null,null,null,"Individual (Couple)","Individual (Couple)",null,null,null,null,"Applicant 2","Applicant 1",null,null,null,null,2,null,null,null,null,null,150000,0,0,0,0,0,0,0,0,0,0,0,0,0,0,0,0,0,0,0,0,0,0,0,0,0,0,0,0,0,20000,0,0,0,0,0,100000,0,0,0,0,0,4000,0,0,0,0,0,0,0,0,0,0,0,0,0,0,0,"Yes","No","No","Yes","Yes","Yes","Yes","Yes","Yes","Yes","No","Yes","Yes","No","No","No",0,0,0,0,47451.4,0,0,0,0,0,118548.6,0,0,0,0,0,118548.6,56724.83,0,0,0,0,0,56724.83,48000,56724.83,61823.78,5.5E-2,0.02,3.8199999999999998E-2,6.0400000000000002E-2,1.25,0.8,0.25,13833.33,9879.0499999999993,4727.07,5151.9799999999996,4198.3,0,166000,118548.6,56724.83,61823.78,50379.64,0,13833.33,9879.0499999999993,4727.07,5151.9799999999996,4794.0200000000004,0,166000,118548.6,56724.83,61823.78,57528.23,0,1.22,0.30349180227473499,"PASS",1.07,0.34655562737885331,"PASS",500000,47451.4,0,0,0,0,0,118548.6,0,0,0,0,0,118548.6,56724.83,0,0,0,0,0,56724.83,48000,56724.83,61823.78,5.5E-2,0.02,3.8199999999999998E-2,6.0400000000000002E-2,1.25,0.8,0.25,13833.33,9879.0499999999993,4727.07,5151.9799999999996,4198.3,0,166000,118548.6,56724.83,61823.78,50379.64,0,13833.33,9879.0499999999993,4727.07,5151.9799999999996,4794.0200000000004,0,166000,118548.6,56724.83,61823.78,57528.23,0,1.22,0.30349180227473499,"PASS",1.07,0.34655562737885331,"PASS",500000,"Pass","Y","2023-10-25T09:22:25",null,"Case 11","Neil "]
[200000,0.05,7.5000000000000011E-2,30,0,200000,0.05,7.5000000000000011E-2,30,0,null,null,null,null,null,"Individual (Couple)","Individual (Couple)","","","","","Applicant 2","Applicant 1","","","","","","","","","","",0,10000,0,0,0,0,35000,0,0,0,0,0,0,0,0,0,0,0,0,0,0,0,0,0,0,0,0,0,0,0,0,0,0,0,0,0,0,0,0,0,0,0,100,0,0,0,0,0,0,0,0,0,0,0,0,0,0,0,"Yes","No","No","Yes","Yes","Yes","Yes","Yes","Yes","Yes","No","Yes","Yes","No","No","No",0,0,0,0,0,0,0,0,0,0,35000,10000,0,0,0,0,45000,29969.05,0,0,0,0,0,29969.05,1200,29969.05,15030.95,5.5E-2,0.02,3.8199999999999998E-2,6.0400000000000002E-2,1.25,0.8,0.25,3750,3750,2497.42,1252.58,1073.6400000000001,0,45000,45000,29969.05,15030.95,12883.72,0,3750,3750,2497.42,1252.58,1330.61,0,45000,45000,29969.05,15030.95,15967.26,0,1.1599999999999999,0.28630486560647417,"FAIL",0.94,0.35482799742889776,"FAIL",150608.18,0,0,0,0,0,0,35000,10000,0,0,0,0,45000,29969.05,0,0,0,0,0,29969.05,1200,29969.05,15030.95,5.5E-2,0.02,3.8199999999999998E-2,6.0400000000000002E-2,1.25,0.8,0.25,3750,3750,2497.42,1252.58,1073.6400000000001,0,45000,45000,29969.05,15030.95,12883.72,0,3750,3750,2497.42,1252.58,1330.61,0,45000,45000,29969.05,15030.95,15967.26,0,1.1599999999999999,0.28630486560647417,"FAIL",0.94,0.35482799742889776,"FAIL",150608.18,"Pass","Y","2023-10-25T09:22:28",null,"Case 12","Neil "]
[1000000,0.05,7.5000000000000011E-2,30,0,1000000,0.05,7.5000000000000011E-2,30,0,null,null,null,null,null,"Individual (Couple)","Individual (Couple)","","","","","Applicant 2","Applicant 1","","","","","","","","","","",0,0,0,0,0,0,0,0,0,0,0,0,0,0,0,0,0,0,0,0,0,0,0,0,0,0,0,0,0,0,200000,0,0,0,0,0,1000000,0,0,0,0,0,100,0,0,0,0,0,0,0,0,0,0,0,0,0,0,0,"Yes","No","No","Yes","Yes","Yes","Yes","Yes","Yes","Yes","No","Yes","Yes","No","No","No",0,0,0,0,24829,0,0,0,0,0,135171,0,0,0,0,0,135171,40017.74,0,0,0,0,0,40017.74,1200,40017.74,95153.26,5.5E-2,0.02,3.8199999999999998E-2,6.0400000000000002E-2,1.25,0.8,0.25,13333.33,11264.25,3334.81,7929.44,5368.22,0,160000,135171,40017.74,95153.26,64418.59,0,13333.33,11264.25,3334.81,7929.44,6653.03,0,160000,135171,40017.74,95153.26,79836.3,0,1.47,0.40261621725910429,"PASS",1.19,0.4989768713843874,"PASS",1000000,24829,0,0,0,0,0,135171,0,0,0,0,0,135171,40017.74,0,0,0,0,0,40017.74,1200,40017.74,95153.26,5.5E-2,0.02,3.8199999999999998E-2,6.0400000000000002E-2,1.25,0.8,0.25,13333.33,11264.25,3334.81,7929.44,5368.22,0,160000,135171,40017.74,95153.26,64418.59,0,13333.33,11264.25,3334.81,7929.44,6653.03,0,160000,135171,40017.74,95153.26,79836.3,0,1.47,0.40261621725910429,"PASS",1.19,0.4989768713843874,"PASS",1000000,"Pass","Y","2023-10-25T09:22:30",null,"Case 13","Neil "]
[1500000,0.06,8.4999999999999992E-2,30,0,1500000,0.06,8.4999999999999992E-2,30,0,null,null,null,null,null,"Individual (Couple)","Individual (Couple)","Individual (Single)","","","","Applicant 2","Applicant 1","","","","","","","","","","",300000,10000,0,0,0,0,35000,0,35000,0,0,0,116000,0,0,0,0,0,15000,0,0,0,0,0,0,0,0,0,0,0,0,0,0,0,0,0,0,0,0,0,0,0,100,0,0,0,0,0,0,0,0,0,0,0,0,0,0,0,"Yes","No","No","Yes","Yes","Yes","Yes","Yes","Yes","Yes","No","Yes","Yes","No","No","No",0,0,0,0,166187,0,0,0,0,0,299813,10000,35000,0,0,0,344813,68194.539999999994,0,15787.04,0,0,0,83981.58,1200,83981.58,260831.42,5.5E-2,0.02,3.8199999999999998E-2,6.0400000000000002E-2,1.25,0.8,0.25,42583.33,28734.42,6998.47,21735.95,8993.26,0,511000,344813,83981.58,260831.42,107919.09,0,42583.33,28734.42,6998.47,21735.95,11006.47,0,511000,344813,83981.58,260831.42,132077.62,0,2.41,0.21119196580723176,"PASS",1.97,0.25846893013363548,"PASS",1500000,166187,0,0,0,0,0,299813,10000,35000,0,0,0,344813,68194.539999999994,0,15787.04,0,0,0,83981.58,1200,83981.58,260831.42,5.5E-2,0.02,3.8199999999999998E-2,6.0400000000000002E-2,1.25,0.8,0.25,42583.33,28734.42,6998.47,21735.95,8993.26,0,511000,344813,83981.58,260831.42,107919.09,0,42583.33,28734.42,6998.47,21735.95,11006.47,0,511000,344813,83981.58,260831.42,132077.62,0,2.41,0.21119196580723176,"PASS",1.97,0.25846893013363548,"PASS",1500000,"Pass","Y","2023-10-25T09:22:33",null,"Case 14","Neil "]
[1000000,0.06,8.4999999999999992E-2,30,0,1000000,0.06,8.4999999999999992E-2,30,0,null,null,null,null,null,"Individual (Single)","Individual (Couple)","Individual (Couple)","","","","","Applicant 3","Applicant 2","","","","","","","","","",0,50000,0,0,0,0,0,0,0,0,0,0,25000,0,0,0,0,0,0,0,0,0,0,0,0,0,0,0,0,0,0,60000,60000,0,0,0,0,500000,500000,0,0,0,1000,0,0,0,0,0,0,0,0,0,0,0,0,0,0,0,"Yes","No","No","Yes","Yes","Yes","Yes","Yes","Yes","Yes","No","Yes","Yes","No","No","No",0,0,0,0,1455.5,13858,0,0,0,0,24244.5,84142,48000,0,0,0,156386.5,15787.04,35884.050000000003,0,0,0,0,51671.09,12000,51671.09,104715.41,5.5E-2,0.02,3.8199999999999998E-2,6.0400000000000002E-2,1.25,0.8,0.25,14250,13032.21,4305.92,8726.2800000000007,5995.51,0,171000,156386.5,51671.09,104715.41,71946.06,0,14250,13032.21,4305.92,8726.2800000000007,7337.65,0,171000,156386.5,51671.09,104715.41,88051.75,0,1.45,0.42073721063351038,"PASS",1.18,0.51492250798552719,"PASS",1000000,1455.5,13858,0,0,0,0,24244.5,84142,48000,0,0,0,156386.5,15787.04,35884.050000000003,0,0,0,0,51671.09,12000,51671.09,104715.41,5.5E-2,0.02,3.8199999999999998E-2,6.0400000000000002E-2,1.25,0.8,0.25,14250,13032.21,4305.92,8726.2800000000007,5995.51,0,171000,156386.5,51671.09,104715.41,71946.06,0,14250,13032.21,4305.92,8726.2800000000007,7337.65,0,171000,156386.5,51671.09,104715.41,88051.75,0,1.45,0.42073721063351038,"PASS",1.18,0.51492250798552719,"PASS",1000000,"Pass","Y","2023-10-25T09:22:37",null,"Case 15","Neil "]
[200000,0.05,7.5000000000000011E-2,30,0,200000,0.05,7.5000000000000011E-2,30,0,null,null,null,null,null,"Individual (Single)","","","","","","","","","","","",1,"","","","","",107000,0,0,0,0,0,0,0,0,0,0,0,0,0,0,0,0,0,0,0,0,0,0,0,0,0,0,0,0,0,0,0,0,0,0,0,0,0,0,0,0,0,100,0,0,0,0,0,0,0,0,0,0,0,0,0,0,0,"Yes","No","No","Yes","Yes","Yes","Yes","Yes","Yes","Yes","No","Yes","Yes","No","No","No",0,10000,1000,1000,27382,0,0,0,0,0,79618,0,0,0,0,0,79618,31813.96,0,0,0,0,0,31813.96,1200,31813.96,47804.04,5.5E-2,0.02,3.8199999999999998E-2,6.0400000000000002E-2,1.25,0.8,0.25,8916.67,6634.83,2651.16,3983.67,1073.6400000000001,1382,107000,79618,31813.96,47804.04,12883.72,16584,8916.67,6634.83,2651.16,3983.67,1330.61,1382,107000,79618,31813.96,47804.04,15967.26,16584,1.62,0.27539924254477888,"PASS",1.46,0.30421738209626542,"PASS",200000,27382,0,0,0,0,0,79618,0,0,0,0,0,79618,31813.96,0,0,0,0,0,31813.96,1200,31813.96,47804.04,5.5E-2,0.02,3.8199999999999998E-2,6.0400000000000002E-2,1.25,0.8,0.25,8916.67,6634.83,2651.16,3983.67,1073.6400000000001,1382,107000,79618,31813.96,47804.04,12883.72,16584,8916.67,6634.83,2651.16,3983.67,1330.61,1382,107000,79618,31813.96,47804.04,15967.26,16584,1.62,0.27539924254477888,"PASS",1.46,0.30421738209626542,"PASS",200000,"Pass","Y","2023-10-25T09:22:40",null,"Case 16","Neil "]
[200000,0.05,7.5000000000000011E-2,30,0,200000,0.05,7.5000000000000011E-2,30,0,null,null,null,null,null,"Individual (Single)","","","","","","","","","","","",1,"","","","","",107000,0,0,0,0,0,25000,0,0,0,0,0,0,0,0,0,0,0,0,0,0,0,0,0,0,0,0,0,0,0,0,0,0,0,0,0,0,0,0,0,0,0,100,0,0,0,0,0,0,0,0,0,0,0,0,0,0,0,"Yes","No","No","Yes","Yes","Yes","Yes","Yes","Yes","Yes","No","Yes","Yes","No","No","No",0,10000,1000,1000,27382,0,0,0,0,0,104618,0,0,0,0,0,104618,35653.879999999997,0,0,0,0,0,35653.879999999997,1200,35653.879999999997,68964.12,5.5E-2,0.02,3.8199999999999998E-2,6.0400000000000002E-2,1.25,0.8,0.25,11000,8718.17,2971.16,5747.01,1073.6400000000001,1382,132000,104618,35653.879999999997,68964.12,12883.72,16584,11000,8718.17,2971.16,5747.01,1330.61,1382,132000,104618,35653.879999999997,68964.12,15967.26,16584,2.34,0.22324029509311621,"PASS",2.11,0.2466004536689424,"PASS",200000,27382,0,0,0,0,0,104618,0,0,0,0,0,104618,35653.879999999997,0,0,0,0,0,35653.879999999997,1200,35653.879999999997,68964.12,5.5E-2,0.02,3.8199999999999998E-2,6.0400000000000002E-2,1.25,0.8,0.25,11000,8718.17,2971.16,5747.01,1073.6400000000001,1382,132000,104618,35653.879999999997,68964.12,12883.72,16584,11000,8718.17,2971.16,5747.01,1330.61,1382,132000,104618,35653.879999999997,68964.12,15967.26,16584,2.34,0.22324029509311621,"PASS",2.11,0.2466004536689424,"PASS",200000,"Pass","Y","2023-10-25T09:22:43",null,"Case 17","Neil "]
[2500000,6.7900000000000002E-2,9.290000000000001E-2,40,5,2500000,6.7900000000000002E-2,9.290000000000001E-2,40,5,null,null,null,null,null,"Company","Individual (Single)","Individual (Couple)","Individual (Couple)","Individual (Couple)","Individual (Single)",null,null,"Non-loan Party","Applicant 5","Applicant 4",null,null,null,null,null,null,null,0,0,80000,0,0,300000,0,0,0,0,0,0,535000,150000,0,0,0,0,75000,0,0,0,0,0,0,0,0,0,0,0,0,0,0,50000,50000,0,0,0,0,1000000,1000000,0,0,0,0,0,0,0,0,0,0,0,0,20000,0,0,0,0,"Yes","No","No","Yes","Yes","Yes","Yes","Yes","Yes","Yes","No","Yes","Yes","No","No","No",0,50000,15000,0,133750,43567,18067,0,0,111667,476250,106433,61933,40000,40000,188333,912949,0,34987.730000000003,35884.050000000003,29253.9,0,46336.67,146462.34,240000,240000,672949,5.5E-2,0.02,3.8199999999999998E-2,6.0400000000000002E-2,1.25,0.8,0.25,101666.67,76079.08,20000,56079.08,15604.88,16910,1220000,912949,240000,672949,187258.53,202920,101666.67,76079.08,20000,56079.08,19208.39,16910,1220000,912949,240000,672949,230500.65,202920,1.72,0.3198184710732348,"PASS",1.55,0.35526283177370244,"PASS",2500000,133750,43567,18067,0,0,111667,476250,106433,61933,40000,40000,188333,912949,0,34987.730000000003,35884.050000000003,29253.9,0,46336.67,146462.34,240000,240000,672949,5.5E-2,0.02,3.8199999999999998E-2,6.0400000000000002E-2,1.25,0.8,0.25,101666.67,76079.08,20000,56079.08,15604.88,16910,1220000,912949,240000,672949,187258.53,202920,101666.67,76079.08,20000,56079.08,19208.39,16910,1220000,912949,240000,672949,230500.65,202920,1.72,0.3198184710732348,"PASS",1.55,0.35526283177370244,"PASS",2500000,"Pass","Y","2023-10-25T09:22:48",null,"Case 18","Neil "]
[2500000,6.7900000000000002E-2,9.290000000000001E-2,40,5,2500000,6.7900000000000002E-2,9.290000000000001E-2,40,5,null,null,null,null,null,"Company","Individual (Single)","Individual (Couple)","Individual (Couple)","Individual (Couple)","Individual (Single)","","","Non-loan Party","Applicant 5","Applicant 4","","","","","","","",0,0,80000,30000,40000,0,0,0,0,0,0,75000,0,150000,0,0,0,0,75000,0,0,0,0,0,535000,0,0,0,0,0,0,0,0,50000,50000,0,0,0,0,1000000,1000000,0,0,0,0,0,0,0,0,0,0,0,0,20000,0,0,0,0,"Yes","No","No","Yes","Yes","Yes","Yes","Yes","Yes","Yes","No","Yes","Yes","No","No","No",0,50000,15000,0,133750,43567,18067,0,266,0,476250,106433,61933,70000,80000,75000,869616,0,34987.730000000003,35884.050000000003,29253.9,0,22426.95,122552.63,240000,240000,629616,5.5E-2,0.02,3.8199999999999998E-2,6.0400000000000002E-2,1.25,0.8,0.25,88750,72468,20000,52468,15604.88,16910,1065000,869616,240000,629616,187258.53,202920,88750,72468,20000,52468,19208.39,16910,1065000,869616,240000,629616,230500.65,202920,1.61,0.36636482132333004,"PASS",1.45,0.40696775095203469,"PASS",2500000,133750,43567,18067,0,266,0,476250,106433,61933,70000,80000,75000,869616,0,34987.730000000003,35884.050000000003,29253.9,0,22426.95,122552.63,240000,240000,629616,5.5E-2,0.02,3.8199999999999998E-2,6.0400000000000002E-2,1.25,0.8,0.25,88750,72468,20000,52468,15604.88,16910,1065000,869616,240000,629616,187258.53,202920,88750,72468,20000,52468,19208.39,16910,1065000,869616,240000,629616,230500.65,202920,1.61,0.36636482132333004,"PASS",1.45,0.40696775095203469,"PASS",2500000,"Pass","Y","2023-10-25T09:22:51",null,"Case 19","Neil "]
[2500000,6.7900000000000002E-2,9.290000000000001E-2,40,5,2500000,6.7900000000000002E-2,9.290000000000001E-2,40,5,null,null,null,null,null,"Company","Individual (Single)","Individual (Couple)","Individual (Couple)","Individual (Couple)","Individual (Single)",null,null,"Non-loan Party","Applicant 5","Applicant 4",null,null,null,null,null,null,null,0,0,80000,30000,40000,0,0,0,0,0,0,75000,535000,150000,0,0,0,0,75000,0,0,0,0,0,0,0,0,0,0,0,0,0,0,50000,50000,0,0,0,0,1000000,1000000,0,0,0,0,0,0,0,0,0,0,0,0,20000,0,0,0,0,"Yes","No","No","Yes","Yes","Yes","Yes","Yes","Yes","Yes","No","Yes","Yes","No","No","No",0,50000,15000,0,133750,43567,18067,0,266,0,476250,106433,61933,70000,80000,75000,869616,0,34987.730000000003,35884.050000000003,29253.9,0,22426.95,122552.63,240000,240000,629616,5.5E-2,0.02,3.8199999999999998E-2,6.0400000000000002E-2,1.25,0.8,0.25,88750,72468,20000,52468,15604.88,16910,1065000,869616,240000,629616,187258.53,202920,88750,72468,20000,52468,19208.39,16910,1065000,869616,240000,629616,230500.65,202920,1.61,0.36636482132333004,"PASS",1.45,0.40696775095203469,"PASS",2500000,133750,43567,18067,0,266,0,476250,106433,61933,70000,80000,75000,869616,0,34987.730000000003,35884.050000000003,29253.9,0,22426.95,122552.63,240000,240000,629616,5.5E-2,0.02,3.8199999999999998E-2,6.0400000000000002E-2,1.25,0.8,0.25,88750,72468,20000,52468,15604.88,16910,1065000,869616,240000,629616,187258.53,202920,88750,72468,20000,52468,19208.39,16910,1065000,869616,240000,629616,230500.65,202920,1.61,0.36636482132333004,"PASS",1.45,0.40696775095203469,"PASS",2500000,"Pass","Y","2023-10-25T09:22:54",null,"Case 20","Neil "]
[2500000,6.7900000000000002E-2,9.290000000000001E-2,40,5,2500000,6.7900000000000002E-2,9.290000000000001E-2,40,5,null,null,null,null,null,"Company","Individual (Single)","Individual (Couple)","Individual (Couple)","Individual (Couple)","Individual (Single)",null,null,"Non-loan Party","Applicant 5","Applicant 4",null,null,null,null,null,null,null,0,0,80000,30000,40000,0,0,0,0,0,0,409501,535000,150000,0,0,0,0,75000,0,0,0,0,0,0,0,0,0,0,0,0,0,0,50000,50000,0,0,0,0,1000000,1000000,0,0,0,0,0,0,0,0,0,0,0,0,20000,0,0,0,0,"Yes","No","No","Yes","Yes","Yes","Yes","Yes","Yes","Yes","No","Yes","Yes","No","No","No",0,50000,15000,0,133750,43567,18067,0,266,0,476250,106433,61933,70000,80000,409501,1204117,0,34987.730000000003,35884.050000000003,29253.9,0,54784.97,154910.65,240000,240000,964117,5.5E-2,0.02,3.8199999999999998E-2,6.0400000000000002E-2,1.25,0.8,0.25,116625.08,100343.08,20000,80343.08,15604.88,16910,1399501,1204117,240000,964117,187258.53,202920,116625.08,100343.08,20000,80343.08,19208.39,16910,1399501,1204117,240000,964117,230500.65,202920,2.4700000000000002,0.27879832505253405,"PASS",2.2200000000000002,0.30969656667906414,"PASS",2500000,133750,43567,18067,0,266,0,476250,106433,61933,70000,80000,409501,1204117,0,34987.730000000003,35884.050000000003,29253.9,0,54784.97,154910.65,240000,240000,964117,5.5E-2,0.02,3.8199999999999998E-2,6.0400000000000002E-2,1.25,0.8,0.25,116625.08,100343.08,20000,80343.08,15604.88,16910,1399501,1204117,240000,964117,187258.53,202920,116625.08,100343.08,20000,80343.08,19208.39,16910,1399501,1204117,240000,964117,230500.65,202920,2.4700000000000002,0.27879832505253405,"PASS",2.2200000000000002,0.30969656667906414,"PASS",2500000,"Pass","Y","2023-10-25T09:22:56",null,"Case 21","Neil "]
[2500000,6.7900000000000002E-2,9.290000000000001E-2,40,5,2500000,6.7900000000000002E-2,9.290000000000001E-2,40,5,null,null,null,null,null,"Company","Individual (Single)","Individual (Couple)","Individual (Couple)","Individual (Couple)","Individual (Single)",null,null,"Non-loan Party","Applicant 5","Applicant 4",null,null,null,null,null,null,null,0,0,80000,30000,40000,1,0,0,0,0,0,0,535000,150000,0,0,0,0,75000,0,0,0,0,0,0,0,0,0,0,0,0,0,0,50000,50000,0,0,0,0,1000000,1000000,0,0,0,0,0,0,0,0,0,0,0,0,20000,0,0,0,0,"Yes","No","No","Yes","Yes","Yes","Yes","Yes","Yes","Yes","No","Yes","Yes","No","No","No",0,50000,15000,0,133750,43567,18067,0,266,0,476250,106433,61933,70000,80000,1,794617,0,34987.730000000003,35884.050000000003,29253.9,0,14900.75,115026.42,240000,240000,554617,5.5E-2,0.02,3.8199999999999998E-2,6.0400000000000002E-2,1.25,0.8,0.25,82500.08,66218.080000000002,20000,46218.080000000002,15604.88,16910,990001,794617,240000,554617,187258.53,202920,82500.08,66218.080000000002,20000,46218.080000000002,19208.39,16910,990001,794617,240000,554617,230500.65,202920,1.42,0.39411933392930559,"PASS",1.27,0.43779819895527072,"PASS",2500000,133750,43567,18067,0,266,0,476250,106433,61933,70000,80000,1,794617,0,34987.730000000003,35884.050000000003,29253.9,0,14900.75,115026.42,240000,240000,554617,5.5E-2,0.02,3.8199999999999998E-2,6.0400000000000002E-2,1.25,0.8,0.25,82500.08,66218.080000000002,20000,46218.080000000002,15604.88,16910,990001,794617,240000,554617,187258.53,202920,82500.08,66218.080000000002,20000,46218.080000000002,19208.39,16910,990001,794617,240000,554617,230500.65,202920,1.42,0.39411933392930559,"PASS",1.27,0.43779819895527072,"PASS",2500000,"Pass","Y","2023-10-25T09:22:58",null,"Case 22","Neil "]
[2500000,6.7900000000000002E-2,9.290000000000001E-2,40,5,2500000,6.7900000000000002E-2,9.290000000000001E-2,40,5,null,null,null,null,null,"Company","Individual (Single)","Individual (Couple)","Individual (Couple)","Individual (Couple)","Individual (Single)","","","Non-loan Party","Applicant 5","Applicant 4","","","","","","","",0,0,80000,30000,40000,1,0,0,0,0,0,500000,0,1,0,0,0,0,75000,0,0,0,0,0,35000,0,0,0,0,0,0,0,0,50000,50000,0,0,0,0,1000000,1000000,0,0,0,0,0,0,0,0,0,0,0,0,20000,0,0,0,0,"Yes","No","No","Yes","Yes","Yes","Yes","Yes","Yes","Yes","No","Yes","Yes","No","No","No",0,50000,15000,0,8750,0,18067,0,266,0,101250,1,61933,70000,80000,500001,813185,0,14900.75,35884.050000000003,29253.9,0,54784.97,134823.67000000001,240000,240000,573185,5.5E-2,0.02,3.8199999999999998E-2,6.0400000000000002E-2,1.25,0.8,0.25,70000.17,67765.42,20000,47765.42,15604.88,16910,840002,813185,240000,573185,187258.53,202920,70000.17,67765.42,20000,47765.42,19208.39,16910,840002,813185,240000,573185,230500.65,202920,1.46,0.46449714966077044,"PASS",1.32,0.51597574144337388,"PASS",2500000,8750,0,18067,0,266,0,101250,1,61933,70000,80000,500001,813185,0,14900.75,35884.050000000003,29253.9,0,54784.97,134823.67000000001,240000,240000,573185,5.5E-2,0.02,3.8199999999999998E-2,6.0400000000000002E-2,1.25,0.8,0.25,70000.17,67765.42,20000,47765.42,15604.88,16910,840002,813185,240000,573185,187258.53,202920,70000.17,67765.42,20000,47765.42,19208.39,16910,840002,813185,240000,573185,230500.65,202920,1.46,0.46449714966077044,"PASS",1.32,0.51597574144337388,"PASS",2500000,"Pass","Y","2023-10-25T09:23:01",null,"Case 23","Neil "]
[2000000,5.2900000000000003E-2,7.7899999999999997E-2,30,3,2000000,5.2900000000000003E-2,7.7899999999999997E-2,30,3,null,null,null,null,null,"Company","Individual (Single)","","","","","","","","","","","","","","","","",0,0,0,0,0,0,0,30000,0,0,0,0,0,0,0,0,0,0,0,0,0,0,0,0,300000,0,0,0,0,0,0,0,0,0,0,0,0,0,0,0,0,0,0,0,0,0,0,0,0,0,0,0,0,0,0,0,0,0,"Yes","No","No","Yes","Yes","Yes","Yes","Yes","Yes","Yes","No","Yes","Yes","No","No","No",0,0,0,0,75000,0,0,0,0,0,225000,30000,0,0,0,0,255000,0,15787.04,0,0,0,0,15787.04,0,15787.04,239212.96,5.5E-2,0.02,3.8199999999999998E-2,6.0400000000000002E-2,1.25,0.8,0.25,27500,21250,1315.59,19934.41,11608.05,0,330000,255000,15787.04,239212.96,139296.62,0,27500,21250,1315.59,19934.41,14136.59,0,330000,255000,15787.04,239212.96,169639.12,0,1.71,0.42211097872910236,"PASS",1.41,0.51405794238893909,"PASS",2000000,75000,0,0,0,0,0,225000,30000,0,0,0,0,255000,0,15787.04,0,0,0,0,15787.04,0,15787.04,239212.96,5.5E-2,0.02,3.8199999999999998E-2,6.0400000000000002E-2,1.25,0.8,0.25,27500,21250,1315.59,19934.41,11608.05,0,330000,255000,15787.04,239212.96,139296.62,0,27500,21250,1315.59,19934.41,14136.59,0,330000,255000,15787.04,239212.96,169639.12,0,1.71,0.42211097872910236,"PASS",1.41,0.51405794238893909,"PASS",2000000,"Pass","Y","2023-10-25T09:23:04",null,"Case 24","Neil "]
[2000000,5.2900000000000003E-2,7.7899999999999997E-2,30,3,2000000,5.2900000000000003E-2,7.7899999999999997E-2,30,3,null,null,null,null,null,"Individual (Single)","Individual (Single)","","","","","","","","","","","","","","","","",0,1,0,0,0,0,0,30000,0,0,0,0,330000,0,0,0,0,0,0,0,0,0,0,0,0,0,0,0,0,0,0,0,0,0,0,0,0,0,0,0,0,0,0,0,0,0,0,0,0,0,0,0,0,0,0,0,0,0,"Yes","No","No","Yes","Yes","Yes","Yes","Yes","Yes","Yes","No","Yes","Yes","No","No","No",0,0,0,0,125767,0,0,0,0,0,204233,30001,0,0,0,0,234234,52623.56,15787.04,0,0,0,0,68410.600000000006,0,68410.600000000006,165823.4,5.5E-2,0.02,3.8199999999999998E-2,6.0400000000000002E-2,1.25,0.8,0.25,30000.080000000002,19519.5,5700.88,13818.62,11608.05,0,360001,234234,68410.600000000006,165823.4,139296.62,0,30000.080000000002,19519.5,5700.88,13818.62,14136.59,0,360001,234234,68410.600000000006,165823.4,169639.12,0,1.19,0.38693398901837434,"PASS",0.97,0.47121847158299529,"FAIL",1954926.42,125767,0,0,0,0,0,204233,30001,0,0,0,0,234234,52623.56,15787.04,0,0,0,0,68410.600000000006,0,68410.600000000006,165823.4,5.5E-2,0.02,3.8199999999999998E-2,6.0400000000000002E-2,1.25,0.8,0.25,30000.080000000002,19519.5,5700.88,13818.62,11608.05,0,360001,234234,68410.600000000006,165823.4,139296.62,0,30000.080000000002,19519.5,5700.88,13818.62,14136.59,0,360001,234234,68410.600000000006,165823.4,169639.12,0,1.19,0.38693398901837434,"PASS",0.97,0.47121847158299529,"FAIL",1954926.42,"Pass","Y","2023-10-25T09:23:06",null,"Case 25","Neil "]
[1500000,0.06,8.4999999999999992E-2,30,0,1500000,0.06,8.4999999999999992E-2,30,0,null,null,null,null,null,"Individual (Couple)","Individual (Couple)","Individual (Single)","Individual (Single)",null,null,"Applicant 2","Applicant 1",null,null,null,null,null,null,null,null,null,null,36000,10000,0,0,0,0,35000,0,35000,100000,0,0,0,0,0,0,0,0,10000,0,0,0,0,0,0,0,0,0,0,0,0,0,0,0,0,0,0,0,0,0,0,0,100,0,0,0,0,0,0,0,0,0,0,0,0,0,0,0,"Yes","No","No","Yes","Yes","Yes","Yes","Yes","Yes","Yes","No","Yes","Yes","No","No","No",0,0,0,0,4102,0,0,0,0,0,77598,10000,35000,100000,0,0,222598,35884.050000000003,0,15787.04,26566.720000000001,0,0,78237.81,1200,78237.81,144360.19,5.5E-2,0.02,3.8199999999999998E-2,6.0400000000000002E-2,1.25,0.8,0.25,18833.330000000002,18549.830000000002,6519.82,12030.02,8993.26,0,226000,222598,78237.81,144360.19,107919.09,0,18833.330000000002,18549.830000000002,6519.82,12030.02,11006.47,0,226000,222598,78237.81,144360.19,132077.62,0,1.33,0.47751811737829836,"PASS",1.0900000000000001,0.58441426238180416,"FAIL",1311592.3500000001,4102,0,0,0,0,0,77598,10000,35000,100000,0,0,222598,35884.050000000003,0,15787.04,26566.720000000001,0,0,78237.81,1200,78237.81,144360.19,5.5E-2,0.02,3.8199999999999998E-2,6.0400000000000002E-2,1.25,0.8,0.25,18833.330000000002,18549.830000000002,6519.82,12030.02,8993.26,0,226000,222598,78237.81,144360.19,107919.09,0,18833.330000000002,18549.830000000002,6519.82,12030.02,11006.47,0,226000,222598,78237.81,144360.19,132077.62,0,1.33,0.47751811737829836,"PASS",1.0900000000000001,0.58441426238180416,"FAIL",1311592.3500000001,"Pass","Y","2023-10-25T09:23:09",null,"Case 26","Neil "]
[1000000,0.06,8.4999999999999992E-2,30,0,1000000,0.06,8.4999999999999992E-2,30,0,null,null,null,null,null,"Individual (Single)","Individual (Couple)","Individual (Couple)",null,null,null,null,"Applicant 3","Applicant 2",null,null,null,null,null,null,null,null,null,0,50000,0,0,0,0,0,0,0,0,0,0,25000,0,0,0,0,0,0,0,0,0,0,0,0,0,0,0,0,0,0,60000,60000,0,0,0,0,500000,500000,0,0,0,100,0,0,0,0,0,0,0,0,0,0,0,0,0,0,0,"Yes","No","No","Yes","Yes","Yes","Yes","Yes","Yes","Yes","No","Yes","Yes","No","No","No",0,0,0,0,1455.5,13858,0,0,0,0,24244.5,84142,48000,0,0,0,156386.5,15787.04,35884.050000000003,0,0,0,0,51671.09,1200,51671.09,104715.41,5.5E-2,0.02,3.8199999999999998E-2,6.0400000000000002E-2,1.25,0.8,0.25,14250,13032.21,4305.92,8726.2800000000007,5995.51,0,171000,156386.5,51671.09,104715.41,71946.06,0,14250,13032.21,4305.92,8726.2800000000007,7337.65,0,171000,156386.5,51671.09,104715.41,88051.75,0,1.45,0.42073721063351038,"PASS",1.18,0.51492250798552719,"PASS",1000000,1455.5,13858,0,0,0,0,24244.5,84142,48000,0,0,0,156386.5,15787.04,35884.050000000003,0,0,0,0,51671.09,1200,51671.09,104715.41,5.5E-2,0.02,3.8199999999999998E-2,6.0400000000000002E-2,1.25,0.8,0.25,14250,13032.21,4305.92,8726.2800000000007,5995.51,0,171000,156386.5,51671.09,104715.41,71946.06,0,14250,13032.21,4305.92,8726.2800000000007,7337.65,0,171000,156386.5,51671.09,104715.41,88051.75,0,1.45,0.42073721063351038,"PASS",1.18,0.51492250798552719,"PASS",1000000,"Pass","Y","2023-10-25T09:23:12",null,"Case 27","Neil "]
[1000000,0.05,7.5000000000000011E-2,30,0,1000000,0.05,7.5000000000000011E-2,30,0,null,null,null,null,null,"Individual (Couple)","Individual (Couple)",null,null,null,null,"Applicant 2","Applicant 1",null,null,null,null,null,null,null,null,null,null,0,0,0,0,0,0,0,0,0,0,0,0,0,0,0,0,0,0,0,0,0,0,0,0,0,0,0,0,0,0,200000,0,0,0,0,0,1000000,0,0,0,0,0,100,0,0,0,0,0,0,0,0,0,0,0,0,0,0,0,"Yes","No","No","Yes","Yes","Yes","Yes","Yes","Yes","Yes","No","Yes","Yes","No","No","No",0,0,0,0,24829,0,0,0,0,0,135171,0,0,0,0,0,135171,40017.74,0,0,0,0,0,40017.74,1200,40017.74,95153.26,5.5E-2,0.02,3.8199999999999998E-2,6.0400000000000002E-2,1.25,0.8,0.25,13333.33,11264.25,3334.81,7929.44,5368.22,0,160000,135171,40017.74,95153.26,64418.59,0,13333.33,11264.25,3334.81,7929.44,6653.03,0,160000,135171,40017.74,95153.26,79836.3,0,1.47,0.40261621725910429,"PASS",1.19,0.4989768713843874,"PASS",1000000,24829,0,0,0,0,0,135171,0,0,0,0,0,135171,40017.74,0,0,0,0,0,40017.74,1200,40017.74,95153.26,5.5E-2,0.02,3.8199999999999998E-2,6.0400000000000002E-2,1.25,0.8,0.25,13333.33,11264.25,3334.81,7929.44,5368.22,0,160000,135171,40017.74,95153.26,64418.59,0,13333.33,11264.25,3334.81,7929.44,6653.03,0,160000,135171,40017.74,95153.26,79836.3,0,1.47,0.40261621725910429,"PASS",1.19,0.4989768713843874,"PASS",1000000,"Pass","Y","2023-10-25T09:23:15",null,"Case 28","Neil "]
[1500000,0.06,8.4999999999999992E-2,30,0,1500000,0.06,8.4999999999999992E-2,30,0,null,null,null,null,null,"Individual (Couple)","Individual (Couple)","Individual (Single)",null,null,null,"Applicant 2","Applicant 1",null,null,null,null,null,null,null,null,null,null,300000,10000,0,0,0,0,35000,0,35000,0,0,0,116000,0,0,0,0,0,15000,0,0,0,0,0,0,0,0,0,0,0,0,0,0,0,0,0,0,0,0,0,0,0,100,0,0,0,0,0,0,0,0,0,0,0,0,0,0,0,"Yes","No","No","Yes","Yes","Yes","Yes","Yes","Yes","Yes","No","Yes","Yes","No","No","No",0,0,0,0,166187,0,0,0,0,0,299813,10000,35000,0,0,0,344813,68194.539999999994,0,15787.04,0,0,0,83981.58,1200,83981.58,260831.42,5.5E-2,0.02,3.8199999999999998E-2,6.0400000000000002E-2,1.25,0.8,0.25,42583.33,28734.42,6998.47,21735.95,8993.26,0,511000,344813,83981.58,260831.42,107919.09,0,42583.33,28734.42,6998.47,21735.95,11006.47,0,511000,344813,83981.58,260831.42,132077.62,0,2.41,0.21119196580723176,"PASS",1.97,0.25846893013363548,"PASS",1500000,166187,0,0,0,0,0,299813,10000,35000,0,0,0,344813,68194.539999999994,0,15787.04,0,0,0,83981.58,1200,83981.58,260831.42,5.5E-2,0.02,3.8199999999999998E-2,6.0400000000000002E-2,1.25,0.8,0.25,42583.33,28734.42,6998.47,21735.95,8993.26,0,511000,344813,83981.58,260831.42,107919.09,0,42583.33,28734.42,6998.47,21735.95,11006.47,0,511000,344813,83981.58,260831.42,132077.62,0,2.41,0.21119196580723176,"PASS",1.97,0.25846893013363548,"PASS",1500000,"Pass","Y","2023-10-25T09:23:18",null,"Case 29","Neil "]
[200000,0.05,7.5000000000000011E-2,30,0,200000,0.05,7.5000000000000011E-2,30,0,null,null,null,null,null,"Individual (Single)",null,null,null,null,null,null,null,null,null,null,null,1,null,null,null,null,null,107000,0,0,0,0,0,25000,0,0,0,0,0,0,0,0,0,0,0,0,0,0,0,0,0,0,0,0,0,0,0,0,0,0,0,0,0,0,0,0,0,0,0,100,0,0,0,0,0,0,0,0,0,0,0,0,0,0,0,"Yes","No","No","Yes","Yes","Yes","Yes","Yes","Yes","Yes","No","Yes","Yes","No","No","No",0,10000,1000,1000,27382,0,0,0,0,0,104618,0,0,0,0,0,104618,35653.879999999997,0,0,0,0,0,35653.879999999997,1200,35653.879999999997,68964.12,5.5E-2,0.02,3.8199999999999998E-2,6.0400000000000002E-2,1.25,0.8,0.25,11000,8718.17,2971.16,5747.01,1073.6400000000001,1382,132000,104618,35653.879999999997,68964.12,12883.72,16584,11000,8718.17,2971.16,5747.01,1330.61,1382,132000,104618,35653.879999999997,68964.12,15967.26,16584,2.34,0.22324029509311621,"PASS",2.11,0.2466004536689424,"PASS",200000,27382,0,0,0,0,0,104618,0,0,0,0,0,104618,35653.879999999997,0,0,0,0,0,35653.879999999997,1200,35653.879999999997,68964.12,5.5E-2,0.02,3.8199999999999998E-2,6.0400000000000002E-2,1.25,0.8,0.25,11000,8718.17,2971.16,5747.01,1073.6400000000001,1382,132000,104618,35653.879999999997,68964.12,12883.72,16584,11000,8718.17,2971.16,5747.01,1330.61,1382,132000,104618,35653.879999999997,68964.12,15967.26,16584,2.34,0.22324029509311621,"PASS",2.11,0.2466004536689424,"PASS",200000,"Pass","Y","2023-10-25T09:23:21",null,"Case 30","Neil "]
[200000,0.05,7.5000000000000011E-2,30,0,200000,0.05,7.5000000000000011E-2,30,0,null,null,null,null,null,"Individual (Single)","","","","","","","","","","","",1,"","","","","",107000,0,0,0,0,0,0,0,0,0,0,0,0,0,0,0,0,0,0,0,0,0,0,0,0,0,0,0,0,0,0,0,0,0,0,0,0,0,0,0,0,0,100,0,0,0,0,0,0,0,0,0,0,0,0,0,0,0,"Yes","No","No","Yes","Yes","Yes","Yes","Yes","Yes","Yes","No","Yes","Yes","No","No","No",0,10000,1000,1000,27382,0,0,0,0,0,79618,0,0,0,0,0,79618,31813.96,0,0,0,0,0,31813.96,1200,31813.96,47804.04,5.5E-2,0.02,3.8199999999999998E-2,6.0400000000000002E-2,1.25,0.8,0.25,8916.67,6634.83,2651.16,3983.67,1073.6400000000001,1382,107000,79618,31813.96,47804.04,12883.72,16584,8916.67,6634.83,2651.16,3983.67,1330.61,1382,107000,79618,31813.96,47804.04,15967.26,16584,1.62,0.27539924254477888,"PASS",1.46,0.30421738209626542,"PASS",200000,27382,0,0,0,0,0,79618,0,0,0,0,0,79618,31813.96,0,0,0,0,0,31813.96,1200,31813.96,47804.04,5.5E-2,0.02,3.8199999999999998E-2,6.0400000000000002E-2,1.25,0.8,0.25,8916.67,6634.83,2651.16,3983.67,1073.6400000000001,1382,107000,79618,31813.96,47804.04,12883.72,16584,8916.67,6634.83,2651.16,3983.67,1330.61,1382,107000,79618,31813.96,47804.04,15967.26,16584,1.62,0.27539924254477888,"PASS",1.46,0.30421738209626542,"PASS",200000,"Pass","Y","2023-10-25T09:23:23",null,"Case 31","Neil "]
[1500000,0.06,8.4999999999999992E-2,30,0,1500000,0.06,8.4999999999999992E-2,30,0,null,null,null,null,null,"Individual (Couple)","Individual (Couple)","Individual (Single)","Individual (Single)",null,null,"Applicant 2","Applicant 1",null,null,null,null,null,null,null,null,null,null,36000,10000,0,0,0,0,35000,0,35000,100000,0,0,0,0,0,0,0,0,10000,0,0,0,0,0,0,0,0,0,0,0,0,0,0,0,0,0,0,0,0,0,0,0,100,0,0,0,0,0,0,0,0,0,0,0,0,0,0,0,"Yes","No","No","Yes","Yes","Yes","Yes","Yes","Yes","Yes","No","Yes","Yes","No","No","No",0,0,0,0,4102,0,0,0,0,0,77598,10000,35000,100000,0,0,222598,35884.050000000003,0,15787.04,26566.720000000001,0,0,78237.81,1200,78237.81,144360.19,5.5E-2,0.02,3.8199999999999998E-2,6.0400000000000002E-2,1.25,0.8,0.25,18833.330000000002,18549.830000000002,6519.82,12030.02,8993.26,0,226000,222598,78237.81,144360.19,107919.09,0,18833.330000000002,18549.830000000002,6519.82,12030.02,11006.47,0,226000,222598,78237.81,144360.19,132077.62,0,1.33,0.47751811737829836,"PASS",1.0900000000000001,0.58441426238180416,"FAIL",1311592.3500000001,4102,0,0,0,0,0,77598,10000,35000,100000,0,0,222598,35884.050000000003,0,15787.04,26566.720000000001,0,0,78237.81,1200,78237.81,144360.19,5.5E-2,0.02,3.8199999999999998E-2,6.0400000000000002E-2,1.25,0.8,0.25,18833.330000000002,18549.830000000002,6519.82,12030.02,8993.26,0,226000,222598,78237.81,144360.19,107919.09,0,18833.330000000002,18549.830000000002,6519.82,12030.02,11006.47,0,226000,222598,78237.81,144360.19,132077.62,0,1.33,0.47751811737829836,"PASS",1.0900000000000001,0.58441426238180416,"FAIL",1311592.3500000001,"Pass","Y","2023-10-25T09:23:25",null,"Case 32","Neil "]
[3000000,7.0000000000000007E-2,9.5000000000000001E-2,40,5,3000000,7.0000000000000007E-2,9.5000000000000001E-2,40,5,null,null,null,null,null,"Company","Individual (Single)","","","","","","","","","","","","","","","","",0,0,0,0,0,0,0,225000,0,0,0,0,87500,87500,0,0,0,0,22500,22500,0,0,0,0,0,0,0,0,0,0,0,0,0,0,0,0,0,0,0,0,0,0,0,0,0,0,0,0,0,0,0,0,0,0,0,0,4000,0,"Yes","No","No","Yes","Yes","Yes","Yes","Yes","Yes","Yes","No","Yes","Yes","No","No","No",0,0,0,0,21875,20654.5,0,0,0,0,88125,314345.5,0,0,0,0,402470.5,0,52623.56,0,0,0,0,52623.56,48000,100623.56,301846.94,5.5E-2,0.02,3.8199999999999998E-2,6.0400000000000002E-2,1.25,0.8,0.25,37083.33,33539.21,8385.2999999999993,25153.91,19165.689999999999,0,445000,402470.5,100623.56,301846.94,229988.29,0,37083.33,33539.21,8385.2999999999993,25153.91,23519.79,0,445000,402470.5,100623.56,301846.94,282237.46999999997,0,1.31,0.51682761588668136,"PASS",1.06,0.63424150619718878,"FAIL",2566732.19,21875,20654.5,0,0,0,0,88125,314345.5,0,0,0,0,402470.5,0,52623.56,0,0,0,0,52623.56,48000,100623.56,301846.94,5.5E-2,0.02,3.8199999999999998E-2,6.0400000000000002E-2,1.25,0.8,0.25,37083.33,33539.21,8385.2999999999993,25153.91,19165.689999999999,0,445000,402470.5,100623.56,301846.94,229988.29,0,37083.33,33539.21,8385.2999999999993,25153.91,23519.79,0,445000,402470.5,100623.56,301846.94,282237.46999999997,0,1.31,0.51682761588668136,"PASS",1.06,0.63424150619718878,"FAIL",2566732.19,{"$f":"IF(AND(DH35=FQ35,DI35=FR35,DJ35=FS35,DK35=FT35,DL35=FU35,DM35=FV35,DN35=FW35,DO35=FX35,DP35=FY35,DQ35=FZ35,DR35=GA35,DS35=GB35,DT35=GC35,DU35=GD35,DV35=GE35,DW35=GF35,DX35=GG35,DY35=GH35,DZ35=GI35,EA35=GJ35,EB35=GK35,EC35=GL35,ED35=GM35,EE35=GN35,EF35=GO35,EG35=GP35,EH35=GQ35,EI35=GR35,EJ35=GS35,EK35=GT35,EL35=GU35,EM35=GV35,EN35=GW35,EO35=GX35,EP35=GY35,EQ35=GZ35,ER35=HA35,ES35=HB35,ET35=HC35,EU35=HD35,EV35=HE35,EW35=HF35,EX35=HG35,EY35=HH35,EZ35=HI35,FA35=HJ35,FB35=HK35,FC35=HL35,FD35=HM35,FE35=HN35,FF35=HO35,FG35=HP35,FH35=HQ35,FI35=HR35,FJ35=HS35,FK35=HT35,FL35=HU35,FM35=HV35,FN35=HW35,FO35=HX35,FP35=HY35),\"Pass\",\"Fail\")","v":"Pass"},"Y","2023-10-25T09:23:28",null,"Case 33","Neil "]
[3000000,7.0000000000000007E-2,9.5000000000000001E-2,40,5,3000000,7.0000000000000007E-2,9.5000000000000001E-2,40,5,null,null,null,null,null,"Company","Individual (Single)","","","","","","","","","","","","","","","","",0,0,0,0,0,0,0,200000,0,0,0,0,87500,87500,0,0,0,0,22500,22500,0,0,0,0,0,0,0,0,0,0,0,0,0,0,0,0,0,0,0,0,0,0,0,0,0,0,0,0,0,0,0,0,0,0,0,0,4000,0,"Yes","No","No","Yes","Yes","Yes","Yes","Yes","Yes","Yes","No","Yes","Yes","No","No","No",0,0,0,0,21875,20654.5,0,0,0,0,88125,289345.5,0,0,0,0,377470.5,0,52623.56,0,0,0,0,52623.56,48000,100623.56,276846.94,5.5E-2,0.02,3.8199999999999998E-2,6.0400000000000002E-2,1.25,0.8,0.25,35000,31455.88,8385.2999999999993,23070.58,19165.689999999999,0,420000,377470.5,100623.56,276846.94,229988.29,0,35000,31455.88,8385.2999999999993,23070.58,23519.79,0,420000,377470.5,100623.56,276846.94,282237.46999999997,0,1.2,0.5475911644513648,"PASS",0.98,0.67199397680416439,"FAIL",2942628.42,21875,20654.5,0,0,0,0,88125,289345.5,0,0,0,0,377470.5,0,52623.56,0,0,0,0,52623.56,48000,100623.56,276846.94,5.5E-2,0.02,3.8199999999999998E-2,6.0400000000000002E-2,1.25,0.8,0.25,35000,31455.88,8385.2999999999993,23070.58,19165.689999999999,0,420000,377470.5,100623.56,276846.94,229988.29,0,35000,31455.88,8385.2999999999993,23070.58,23519.79,0,420000,377470.5,100623.56,276846.94,282237.46999999997,0,1.2,0.5475911644513648,"PASS",0.98,0.67199397680416439,"FAIL",2942628.42,"Pass","Y","2023-10-25T09:23:30",null,"Case 34","Neil "]
[3000000,7.0000000000000007E-2,9.5000000000000001E-2,40,5,3000000,7.0000000000000007E-2,9.5000000000000001E-2,40,5,null,null,null,null,null,"Company","Individual (Single)","Individual (Couple)","Individual (Couple)","","","","","Applicant 4","Applicant 3","","","","",2,0,"","",0,225000,100000,80000,0,0,0,0,0,0,0,0,87500,87500,37500,12500,0,0,22500,22500,52500,17500,0,0,0,0,0,0,0,0,0,0,20000,20000,0,0,0,0,500000,500000,0,0,0,0,0,0,0,0,0,0,0,0,0,0,0,0,15000,0,"Yes","No","No","Yes","Yes","Yes","Yes","Yes","Yes","Yes","No","Yes","Yes","No","No","No",0,25000,5000,3000,21875,117542,33154,17480.5,0,0,88125,217458,172846,108519.5,0,0,586948.5,0,52623.56,68059.25,0,0,0,120682.81,180000,300682.81,286265.69,5.5E-2,0.02,3.8199999999999998E-2,6.0400000000000002E-2,1.25,0.8,0.25,64750,48912.38,25056.9,23855.47,19165.689999999999,5955,777000,586948.5,300682.81,286265.69,229988.29,71460,64750,48912.38,25056.9,23855.47,23519.79,5955,777000,586948.5,300682.81,286265.69,282237.46999999997,71460,0.94,0.38796433599687674,"FAIL",0.8,0.45520909943082244,"FAIL",2283183.73,21875,117542,33154,17480.5,0,0,88125,217458,172846,108519.5,0,0,586948.5,0,52623.56,68059.25,0,0,0,120682.81,180000,300682.81,286265.69,5.5E-2,0.02,3.8199999999999998E-2,6.0400000000000002E-2,1.25,0.8,0.25,64750,48912.38,25056.9,23855.47,19165.689999999999,5955,777000,586948.5,300682.81,286265.69,229988.29,71460,64750,48912.38,25056.9,23855.47,23519.79,5955,777000,586948.5,300682.81,286265.69,282237.46999999997,71460,0.94,0.38796433599687674,"FAIL",0.8,0.45520909943082244,"FAIL",2283183.73,"Pass","Y","2023-10-25T09:23:33",null,"Case 35","Neil "]
[1500000,5.9900000000000002E-2,8.4900000000000003E-2,30,0,1500000,5.9900000000000002E-2,8.4900000000000003E-2,30,0,null,null,null,null,null,"Individual (Single)","Individual (Couple)","Company","Company","","","","Non-loan party","","","","","",3,"","","","",0,95000,0,25000,0,0,85000,0,0,0,0,0,0,0,0,0,0,0,0,0,0,20000,0,0,0,0,0,0,0,0,0,30000,30000,0,0,0,0,0,1000000,0,0,0,1,0,0,0,0,0,0,0,0,0,0,0,0,0,0,0,"Yes","No","No","Yes","Yes","Yes","Yes","Yes","Yes","Yes","No","Yes","Yes","No","No","No",0,0,1000,0,0,31522,0,6250,0,0,85000,87478,24000,38750,0,0,235228,22426.95,51580.09,0,0,0,0,74007.039999999994,12,74007.039999999994,161220.96,5.5E-2,0.02,3.8199999999999998E-2,6.0400000000000002E-2,1.25,0.8,0.25,22750,19602.330000000002,6167.25,13435.08,8983.6200000000008,1000,273000,235228,74007.039999999994,161220.96,107803.4,12000,22750,19602.330000000002,6167.25,13435.08,10996.01,1000,273000,235228,74007.039999999994,161220.96,131952.16,12000,1.34,0.43884027953634297,"PASS",1.1100000000000001,0.52729730156182208,"PASS",1500000,0,31522,0,6250,0,0,85000,87478,24000,38750,0,0,235228,22426.95,51580.09,0,0,0,0,74007.039999999994,12,74007.039999999994,161220.96,5.5E-2,0.02,3.8199999999999998E-2,6.0400000000000002E-2,1.25,0.8,0.25,22750,19602.330000000002,6167.25,13435.08,8983.6200000000008,1000,273000,235228,74007.039999999994,161220.96,107803.4,12000,22750,19602.330000000002,6167.25,13435.08,10996.01,1000,273000,235228,74007.039999999994,161220.96,131952.16,12000,1.34,0.43884027953634297,"PASS",1.1100000000000001,0.52729730156182208,"PASS",1500000,"Pass","Y","2023-10-25T09:23:35",null,"Case 36","Neil "]
[300000,5.0900000000000001E-2,7.5899999999999995E-2,30,0,300000,5.0900000000000001E-2,7.5899999999999995E-2,30,0,null,null,null,null,null,"Individual (Couple)","Individual (Couple)","","","","","Non-loan Party","Non-loan party","","","","",3,"","","","","",72735,0,0,0,0,0,0,0,0,0,0,0,0,0,0,0,0,0,0,0,0,0,0,0,0,0,0,0,0,0,0,0,0,0,0,0,0,0,0,0,0,0,285,0,291,260,1100,400,700,0,69,0,0,0,48,0,0,0,"Yes","No","No","Yes","Yes","Yes","Yes","Yes","Yes","Yes","No","Yes","Yes","No","No","No",1275,32500,1275,0,15560.58,0,0,0,0,0,57174.43,0,0,0,0,0,57174.43,44544.23,29253.9,0,0,0,0,73798.13,37836,77290.13,-20115.7,5.5E-2,0.02,3.8199999999999998E-2,6.0400000000000002E-2,1.25,0.8,0.25,6061.25,4764.54,6440.84,-1676.31,1627.01,3791.5,72735,57174.43,77290.13,-20115.7,19524.080000000002,45498,6061.25,4764.54,6440.84,-1676.31,2014.07,3791.5,72735,57174.43,77290.13,-20115.7,24168.880000000001,45498,-0.3,0.68360592475269266,"FAIL",-0.28000000000000003,0.74746519411118417,"FAIL",0,15560.58,0,0,0,0,0,57174.43,0,0,0,0,0,57174.43,44544.23,29253.9,0,0,0,0,73798.13,37836,77290.13,-20115.7,5.5E-2,0.02,3.8199999999999998E-2,6.0400000000000002E-2,1.25,0.8,0.25,6061.25,4764.54,6440.84,-1676.31,1627.01,3791.5,72735,57174.43,77290.13,-20115.7,19524.080000000002,45498,6061.25,4764.54,6440.84,-1676.31,2014.07,3791.5,72735,57174.43,77290.13,-20115.7,24168.880000000001,45498,-0.3,0.68360592475269266,"FAIL",-0.28000000000000003,0.74746519411118417,"FAIL",0,"Pass","Y","2023-10-25T09:23:38",null,"Case 37","Neil "]
[300000,0.06,8.4999999999999992E-2,40,0,300000,0.06,8.4999999999999992E-2,40,0,null,null,null,null,null,"Individual (Single)","Individual (Single)","","","","","","","","","","","","","","","","",0,1,0,0,0,0,0,0,0,0,0,0,0,0,0,0,0,0,0,0,0,0,0,0,0,0,0,0,0,0,0,0,0,0,0,0,0,0,0,0,0,0,1,1,1,1,1,1,1,1,1,1,0,1,1,0,1,0,"Yes","No","No","Yes","Yes","Yes","Yes","Yes","Yes","Yes","No","Yes","Yes","No","No","No",0,0,0,0,0,0,0,0,0,0,0,1,0,0,0,0,1,14900.75,14900.75,0,0,0,0,29801.5,156,29837.5,-29836.5,5.5E-2,0.02,3.8199999999999998E-2,6.0400000000000002E-2,1.25,0.8,0.25,0.08,0.08,2486.46,-2486.38,1650.64,0,1,1,29837.5,-29836.5,19807.689999999999,0,0.08,0.08,2486.46,-2486.38,2085.94,0,1,1,29837.5,-29836.5,25031.22,0,-1.5,19807.691061745812,"FAIL",-1.19,25031.220831890379,"FAIL",0,0,0,0,0,0,0,0,1,0,0,0,0,1,14900.75,14900.75,0,0,0,0,29801.5,156,29837.5,-29836.5,5.5E-2,0.02,3.8199999999999998E-2,6.0400000000000002E-2,1.25,0.8,0.25,0.08,0.08,2486.46,-2486.38,1650.64,0,1,1,29837.5,-29836.5,19807.689999999999,0,0.08,0.08,2486.46,-2486.38,2085.94,0,1,1,29837.5,-29836.5,25031.22,0,-1.5,19807.691061745812,"FAIL",-1.19,25031.220831890379,"FAIL",0,"Pass","Y","2023-10-25T09:23:40",null,"Case 38","Neil "]
[100000,6.5000000000000002E-2,0.09,20,0,100000,6.5000000000000002E-2,0.09,20,0,null,null,null,null,null,"Individual (Couple)","","","","","","Non-loan Party","","","","","","","","","","","",25000,0,0,0,0,0,0,0,0,0,0,0,0,0,0,0,0,0,0,0,0,0,0,0,0,0,0,0,0,0,0,0,0,0,0,0,0,0,0,0,0,0,1,1,1000,50,1,100,200,1,500,1,0,1,1,0,1,0,"Yes","No","No","Yes","Yes","Yes","Yes","Yes","Yes","Yes","No","Yes","Yes","No","No","No",0,0,0,0,1455.5,0,0,0,0,0,24244.5,0,0,0,0,0,24244.5,29253.9,0,0,0,0,0,29253.9,22296,41277.9,-17033.400000000001,5.5E-2,0.02,3.8199999999999998E-2,6.0400000000000002E-2,1.25,0.8,0.25,2083.33,2020.38,3439.82,-1419.45,745.57,0,25000,24244.5,41277.9,-17033.400000000001,8946.8799999999992,0,2083.33,2020.38,3439.82,-1419.45,867.82,0,25000,24244.5,41277.9,-17033.400000000001,10413.879999999999,0,-1.9,0.35787510504724657,"FAIL",-1.63,0.41655515201545629,"FAIL",0,1455.5,0,0,0,0,0,24244.5,0,0,0,0,0,24244.5,29253.9,0,0,0,0,0,29253.9,22296,41277.9,-17033.400000000001,5.5E-2,0.02,3.8199999999999998E-2,6.0400000000000002E-2,1.25,0.8,0.25,2083.33,2020.38,3439.82,-1419.45,745.57,0,25000,24244.5,41277.9,-17033.400000000001,8946.8799999999992,0,2083.33,2020.38,3439.82,-1419.45,867.82,0,25000,24244.5,41277.9,-17033.400000000001,10413.879999999999,0,-1.9,0.35787510504724657,"FAIL",-1.63,0.41655515201545629,"FAIL",0,"Pass","Y","2023-10-25T09:23:43",null,"Case 39","Neil "]
[100000,6.5000000000000002E-2,0.09,20,0,100000,6.5000000000000002E-2,0.09,20,0,null,null,null,null,null,"Individual (Couple)","","","","","","Non-loan Party","","","","","","","","","","","",50000,0,0,0,0,0,0,0,0,0,0,0,0,0,0,0,0,0,0,0,0,0,0,0,0,0,0,0,0,0,0,0,0,0,0,0,0,0,0,0,0,0,1,1,1000,50,1,100,200,1,500,1,0,1,1,0,1,0,"Yes","No","No","Yes","Yes","Yes","Yes","Yes","Yes","Yes","No","Yes","Yes","No","No","No",0,0,0,0,7717,0,0,0,0,0,42533,0,0,0,0,0,42533,30992.52,0,0,0,0,0,30992.52,22296,43016.52,-483.52,5.5E-2,0.02,3.8199999999999998E-2,6.0400000000000002E-2,1.25,0.8,0.25,4166.67,3544.42,3584.71,-40.29,745.57,0,50000,42533,43016.52,-483.52,8946.8799999999992,0,4166.67,3544.42,3584.71,-40.29,867.82,0,50000,42533,43016.52,-483.52,10413.879999999999,0,-0.05,0.17893755252362328,"FAIL",-0.04,0.20827757600772814,"FAIL",0,7717,0,0,0,0,0,42533,0,0,0,0,0,42533,30992.52,0,0,0,0,0,30992.52,22296,43016.52,-483.52,5.5E-2,0.02,3.8199999999999998E-2,6.0400000000000002E-2,1.25,0.8,0.25,4166.67,3544.42,3584.71,-40.29,745.57,0,50000,42533,43016.52,-483.52,8946.8799999999992,0,4166.67,3544.42,3584.71,-40.29,867.82,0,50000,42533,43016.52,-483.52,10413.879999999999,0,-0.05,0.17893755252362328,"FAIL",-0.04,0.20827757600772814,"FAIL",0,"Pass","Y","2023-10-25T09:23:45",null,"Case 40","Neil "]
[300000,6.5000000000000002E-2,0.09,20,0,300000,6.5000000000000002E-2,0.09,20,0,null,null,null,null,null,"Individual (Couple)","Individual (Couple)","","","","","Applicant 2","Applicant 1","","","","","","","","","","",85000,45000,0,0,0,0,0,0,0,0,0,0,0,0,0,0,0,0,0,0,0,0,0,0,0,0,0,0,0,0,0,0,0,0,0,0,0,0,0,0,0,0,1,500,1000,50,1,100,200,500,500,1,0,1,1,0,1,0,"Yes","No","No","Yes","Yes","Yes","Yes","Yes","Yes","Yes","No","Yes","Yes","No","No","No",0,0,0,0,19792,5992,0,0,0,0,65208,39333,0,0,0,0,104541,43858.28,0,0,0,0,0,43858.28,34272,61870.28,42670.720000000001,5.5E-2,0.02,3.8199999999999998E-2,6.0400000000000002E-2,1.25,0.8,0.25,10833.33,8711.75,5155.8599999999997,3555.89,2236.7199999999998,0,130000,104541,61870.28,42670.720000000001,26840.63,0,10833.33,8711.75,5155.8599999999997,3555.89,2603.4699999999998,0,130000,104541,61870.28,42670.720000000001,31241.64,0,1.58,0.20646640675802683,"PASS",1.36,0.24032028000891711,"PASS",300000,19792,5992,0,0,0,0,65208,39333,0,0,0,0,104541,43858.28,0,0,0,0,0,43858.28,34272,61870.28,42670.720000000001,5.5E-2,0.02,3.8199999999999998E-2,6.0400000000000002E-2,1.25,0.8,0.25,10833.33,8711.75,5155.8599999999997,3555.89,2236.7199999999998,0,130000,104541,61870.28,42670.720000000001,26840.63,0,10833.33,8711.75,5155.8599999999997,3555.89,2603.4699999999998,0,130000,104541,61870.28,42670.720000000001,31241.64,0,1.58,0.20646640675802683,"PASS",1.36,0.24032028000891711,"PASS",300000,"Pass","Y","2023-10-25T09:23:48",null,"Case 41","Neil "]
[300000,6.5000000000000002E-2,0.09,20,0,300000,6.5000000000000002E-2,0.09,20,0,null,null,null,null,null,"Individual (Couple)","Individual (Couple)","","","","","Applicant 2","Applicant 1","","","","","","","","","","",85000,45000,0,0,0,0,0,0,0,0,0,0,0,0,0,0,0,0,0,0,0,0,0,0,0,0,0,0,0,0,0,0,0,0,0,0,0,0,0,0,0,0,1,500,1000,50,1,100,200,500,500,400,0,1,200,0,1,0,"Yes","No","No","Yes","Yes","Yes","Yes","Yes","Yes","Yes","No","Yes","Yes","No","No","No",0,0,1800,0,19792,5992,0,0,0,0,65208,39333,0,0,0,0,104541,43858.28,0,0,0,0,0,43858.28,41448,61870.28,42670.720000000001,5.5E-2,0.02,3.8199999999999998E-2,6.0400000000000002E-2,1.25,0.8,0.25,10833.33,8711.75,5155.8599999999997,3555.89,2236.7199999999998,1800,130000,104541,61870.28,42670.720000000001,26840.63,21600,10833.33,8711.75,5155.8599999999997,3555.89,2603.4699999999998,1800,130000,104541,61870.28,42670.720000000001,31241.64,21600,0.88,0.37262025291187301,"FAIL",0.8,0.40647412616276324,"FAIL",202230.12,19792,5992,0,0,0,0,65208,39333,0,0,0,0,104541,43858.28,0,0,0,0,0,43858.28,41448,61870.28,42670.720000000001,5.5E-2,0.02,3.8199999999999998E-2,6.0400000000000002E-2,1.25,0.8,0.25,10833.33,8711.75,5155.8599999999997,3555.89,2236.7199999999998,1800,130000,104541,61870.28,42670.720000000001,26840.63,21600,10833.33,8711.75,5155.8599999999997,3555.89,2603.4699999999998,1800,130000,104541,61870.28,42670.720000000001,31241.64,21600,0.88,0.37262025291187301,"FAIL",0.8,0.40647412616276324,"FAIL",202230.12,"Pass","Y","2023-10-25T09:23:50",null,"Case 42","Neil "]
[700000,6.5000000000000002E-2,0.09,30,0,700000,6.5000000000000002E-2,0.09,30,0,null,null,null,null,null,"Individual (Couple)","Individual (Couple)","","","","","Applicant 2","Applicant 1","","","","","","","","","","",100000,45000,0,0,0,0,0,0,0,0,0,0,0,0,0,0,0,0,0,0,0,0,0,0,0,0,0,0,0,0,0,0,0,0,0,0,0,0,0,0,0,0,1,1,1,50,1,100,200,500,500,400,0,1,200,0,1,0,"Yes","No","No","Yes","Yes","Yes","Yes","Yes","Yes","Yes","No","Yes","Yes","No","No","No",0,0,1800,0,24967,5992,0,0,0,0,75033,39333,0,0,0,0,114366,43858.28,0,0,0,0,0,43858.28,23472,43894.28,70471.72,5.5E-2,0.02,3.8199999999999998E-2,6.0400000000000002E-2,1.25,0.8,0.25,12083.33,9530.5,3657.86,5872.64,4424.4799999999996,1800,145000,114366,43894.28,70471.72,53093.71,21600,12083.33,9530.5,3657.86,5872.64,5382.39,1800,145000,114366,43894.28,70471.72,64588.73,21600,0.94,0.51512906188557905,"FAIL",0.81,0.59440505255920018,"FAIL",529578.43999999994,24967,5992,0,0,0,0,75033,39333,0,0,0,0,114366,43858.28,0,0,0,0,0,43858.28,23472,43894.28,70471.72,5.5E-2,0.02,3.8199999999999998E-2,6.0400000000000002E-2,1.25,0.8,0.25,12083.33,9530.5,3657.86,5872.64,4424.4799999999996,1800,145000,114366,43894.28,70471.72,53093.71,21600,12083.33,9530.5,3657.86,5872.64,5382.39,1800,145000,114366,43894.28,70471.72,64588.73,21600,0.94,0.51512906188557905,"FAIL",0.81,0.59440505255920018,"FAIL",529578.43999999994,"Pass","Y","2023-10-25T09:23:52",null,"Case 43","Neil "]
[160000,6.5000000000000002E-2,0.09,30,0,160000,6.5000000000000002E-2,0.09,30,0,null,null,null,null,null,"Individual (Couple)","Individual (Couple)","","","","","Applicant 2","Applicant 1","","","","","","","","","","",56000,35000,0,0,0,0,0,0,0,0,0,0,0,0,0,0,0,0,0,0,0,0,0,0,0,0,0,0,0,0,0,0,0,0,0,0,0,0,0,0,0,0,600,50,1,300,41,100,200,480,500,350,0,1,120,0,1,0,"Yes","No","No","Yes","Yes","Yes","Yes","Yes","Yes","Yes","No","Yes","Yes","No","No","No",0,0,1800,0,9787,3892,0,0,0,0,46373,31808,0,0,0,0,78181,35884.050000000003,0,0,0,0,0,35884.050000000003,32928,36508.050000000003,41672.949999999997,5.5E-2,0.02,3.8199999999999998E-2,6.0400000000000002E-2,1.25,0.8,0.25,7583.33,6515.08,3042.34,3472.75,1011.31,1800,91000,78181,36508.050000000003,41672.949999999997,12135.71,21600,7583.33,6515.08,3042.34,3472.75,1230.26,1800,91000,78181,36508.050000000003,41672.949999999997,14763.14,21600,1.23,0.37072204451719676,"PASS",1.1399999999999999,0.39959493280021108,"PASS",160000,9787,3892,0,0,0,0,46373,31808,0,0,0,0,78181,35884.050000000003,0,0,0,0,0,35884.050000000003,32928,36508.050000000003,41672.949999999997,5.5E-2,0.02,3.8199999999999998E-2,6.0400000000000002E-2,1.25,0.8,0.25,7583.33,6515.08,3042.34,3472.75,1011.31,1800,91000,78181,36508.050000000003,41672.949999999997,12135.71,21600,7583.33,6515.08,3042.34,3472.75,1230.26,1800,91000,78181,36508.050000000003,41672.949999999997,14763.14,21600,1.23,0.37072204451719676,"PASS",1.1399999999999999,0.39959493280021108,"PASS",160000,"Pass","Y","2023-10-25T09:23:54",null,"Case 44","Neil "]
[160000,6.5000000000000002E-2,0.09,30,0,160000,6.5000000000000002E-2,0.09,30,0,null,null,null,null,null,"Individual (Couple)","Individual (Couple)","","","","","Applicant 2","Applicant 1","","","","","","","","","","",58000,35000,0,0,0,0,0,0,0,0,0,0,0,0,0,0,0,0,0,0,0,0,0,0,0,0,0,0,0,0,0,0,0,0,0,0,0,0,0,0,0,0,600,300,1,50,1,100,200,480,500,400,0,1,200,0,1,0,"Yes","No","No","Yes","Yes","Yes","Yes","Yes","Yes","Yes","No","Yes","Yes","No","No","No",0,0,1800,0,10477,3892,0,0,0,0,47653,31808,0,0,0,0,79461,35884.050000000003,0,0,0,0,0,35884.050000000003,34008,39508.050000000003,39952.949999999997,5.5E-2,0.02,3.8199999999999998E-2,6.0400000000000002E-2,1.25,0.8,0.25,7750,6621.75,3292.34,3329.41,1011.31,1800,93000,79461,39508.050000000003,39952.949999999997,12135.71,21600,7750,6621.75,3292.34,3329.41,1230.26,1800,93000,79461,39508.050000000003,39952.949999999997,14763.14,21600,1.18,0.36274952743080541,"PASS",1.0900000000000001,0.39100149338515278,"PASS",160000,10477,3892,0,0,0,0,47653,31808,0,0,0,0,79461,35884.050000000003,0,0,0,0,0,35884.050000000003,34008,39508.050000000003,39952.949999999997,5.5E-2,0.02,3.8199999999999998E-2,6.0400000000000002E-2,1.25,0.8,0.25,7750,6621.75,3292.34,3329.41,1011.31,1800,93000,79461,39508.050000000003,39952.949999999997,12135.71,21600,7750,6621.75,3292.34,3329.41,1230.26,1800,93000,79461,39508.050000000003,39952.949999999997,14763.14,21600,1.18,0.36274952743080541,"PASS",1.0900000000000001,0.39100149338515278,"PASS",160000,"Pass","Y","2023-10-25T09:23:57",null,"Case 45","Neil "]
[100000,6.5000000000000002E-2,0.09,20,0,100000,6.5000000000000002E-2,0.09,20,0,null,null,null,null,null,"Individual (Couple)","","","","","","Non-loan Party","","","","","","","","","","","",41000,0,0,0,0,0,0,0,0,0,0,0,0,0,0,0,0,0,0,0,0,0,0,0,0,0,0,0,0,0,0,0,0,0,0,0,0,0,0,0,0,0,1,1,1000,50,1,100,200,1,500,1,0,1,1,0,1,0,"Yes","No","No","Yes","Yes","Yes","Yes","Yes","Yes","Yes","No","Yes","Yes","No","No","No",0,0,0,0,5152,0,0,0,0,0,36373,0,0,0,0,0,36373,29969.05,0,0,0,0,0,29969.05,22296,41993.05,-5620.05,5.5E-2,0.02,3.8199999999999998E-2,6.0400000000000002E-2,1.25,0.8,0.25,3416.67,3031.08,3499.42,-468.34,745.57,0,41000,36373,41993.05,-5620.05,8946.8799999999992,0,3416.67,3031.08,3499.42,-468.34,867.82,0,41000,36373,41993.05,-5620.05,10413.879999999999,0,-0.62,0.21821652746783327,"FAIL",-0.53,0.25399704391186356,"FAIL",0,5152,0,0,0,0,0,36373,0,0,0,0,0,36373,29969.05,0,0,0,0,0,29969.05,22296,41993.05,-5620.05,5.5E-2,0.02,3.8199999999999998E-2,6.0400000000000002E-2,1.25,0.8,0.25,3416.67,3031.08,3499.42,-468.34,745.57,0,41000,36373,41993.05,-5620.05,8946.8799999999992,0,3416.67,3031.08,3499.42,-468.34,867.82,0,41000,36373,41993.05,-5620.05,10413.879999999999,0,-0.62,0.21821652746783327,"FAIL",-0.53,0.25399704391186356,"FAIL",0,"Pass","Y","2023-10-25T09:23:59",null,"Case 46","Neil "]
[145000,6.5000000000000002E-2,0.09,20,0,145000,6.5000000000000002E-2,0.09,20,0,null,null,null,null,null,"Individual (Couple)","","","","","","Non-loan Party","","","","","","","","","","","",51000,0,0,0,0,0,0,0,0,0,0,0,0,0,0,0,0,0,0,0,0,0,0,0,0,0,0,0,0,0,0,0,0,0,0,0,0,0,0,0,0,0,1,1,1000,250,1,100,200,1,500,1,0,1,1,0,200,0,"Yes","No","No","Yes","Yes","Yes","Yes","Yes","Yes","Yes","No","Yes","Yes","No","No","No",0,0,0,0,8062,0,0,0,0,0,43173,0,0,0,0,0,43173,30992.52,0,0,0,0,0,30992.52,27084,45404.52,-2231.52,5.5E-2,0.02,3.8199999999999998E-2,6.0400000000000002E-2,1.25,0.8,0.25,4250,3597.75,3783.71,-185.96,1081.08,0,51000,43173,45404.52,-2231.52,12972.97,0,4250,3597.75,3783.71,-185.96,1258.3399999999999,0,51000,43173,45404.52,-2231.52,15100.12,0,-0.17,0.25437201094044481,"FAIL",-0.14000000000000001,0.2960808678541233,"FAIL",0,8062,0,0,0,0,0,43173,0,0,0,0,0,43173,30992.52,0,0,0,0,0,30992.52,27084,45404.52,-2231.52,5.5E-2,0.02,3.8199999999999998E-2,6.0400000000000002E-2,1.25,0.8,0.25,4250,3597.75,3783.71,-185.96,1081.08,0,51000,43173,45404.52,-2231.52,12972.97,0,4250,3597.75,3783.71,-185.96,1258.3399999999999,0,51000,43173,45404.52,-2231.52,15100.12,0,-0.17,0.25437201094044481,"FAIL",-0.14000000000000001,0.2960808678541233,"FAIL",0,"Pass","Y","2023-10-25T09:24:01",null,"Case 47","Neil "]
[300000,5.4399999999999997E-2,7.9399999999999998E-2,30,0,300000,5.4399999999999997E-2,7.9399999999999998E-2,30,0,null,null,null,null,null,"Individual (Single)","","","","","","","","","","","","","","","","","",80000,0,0,0,0,0,0,0,0,0,0,0,0,0,0,0,0,0,0,0,0,0,0,0,0,0,0,0,0,0,0,0,0,0,0,0,0,0,0,0,0,0,1,1,1,1,100,50,60,50,20,1,0,1,45,0,60,0,"Yes","No","No","Yes","Yes","Yes","Yes","Yes","Yes","Yes","No","Yes","Yes","No","No","No",0,0,0,0,18067,0,0,0,0,0,61933,0,0,0,0,0,61933,22426.95,0,0,0,0,0,22426.95,4692,23170.95,38762.050000000003,5.5E-2,0.02,3.8199999999999998E-2,6.0400000000000002E-2,1.25,0.8,0.25,6666.67,5161.08,1930.91,3230.17,1692.09,0,80000,61933,23170.95,38762.050000000003,20305.09,0,6666.67,5161.08,1930.91,3230.17,2085.33,0,80000,61933,23170.95,38762.050000000003,25023.98,0,1.9,0.25381360981084861,"PASS",1.54,0.31279977032647882,"PASS",300000,18067,0,0,0,0,0,61933,0,0,0,0,0,61933,22426.95,0,0,0,0,0,22426.95,4692,23170.95,38762.050000000003,5.5E-2,0.02,3.8199999999999998E-2,6.0400000000000002E-2,1.25,0.8,0.25,6666.67,5161.08,1930.91,3230.17,1692.09,0,80000,61933,23170.95,38762.050000000003,20305.09,0,6666.67,5161.08,1930.91,3230.17,2085.33,0,80000,61933,23170.95,38762.050000000003,25023.98,0,1.9,0.25381360981084861,"PASS",1.54,0.31279977032647882,"PASS",300000,"Pass","Y","2023-10-25T09:24:04",null,"Case 48","Neil "]
[300000,5.4399999999999997E-2,7.9399999999999998E-2,30,0,300000,5.4399999999999997E-2,7.9399999999999998E-2,30,0,null,null,null,null,null,"Individual (Single)","","","","","","","","","","","","","","","","","",60000,0,0,0,0,0,0,0,0,0,0,0,0,0,0,0,0,0,0,0,0,0,0,0,0,0,0,0,0,0,0,0,0,0,0,0,0,0,0,0,0,0,1,1,1,1,100,50,60,50,20,1,0,1,45,0,60,0,"Yes","No","No","Yes","Yes","Yes","Yes","Yes","Yes","Yes","No","Yes","Yes","No","No","No",0,0,0,0,11167,0,0,0,0,0,48933,0,0,0,0,0,48933,17528.23,0,0,0,0,0,17528.23,4692,18272.23,30660.77,5.5E-2,0.02,3.8199999999999998E-2,6.0400000000000002E-2,1.25,0.8,0.25,5000,4077.75,1522.69,2555.06,1692.09,0,60000,48933,18272.23,30660.77,20305.09,0,5000,4077.75,1522.69,2555.06,2085.33,0,60000,48933,18272.23,30660.77,25023.98,0,1.51,0.33841814641446483,"PASS",1.22,0.41706636043530515,"PASS",300000,11167,0,0,0,0,0,48933,0,0,0,0,0,48933,17528.23,0,0,0,0,0,17528.23,4692,18272.23,30660.77,5.5E-2,0.02,3.8199999999999998E-2,6.0400000000000002E-2,1.25,0.8,0.25,5000,4077.75,1522.69,2555.06,1692.09,0,60000,48933,18272.23,30660.77,20305.09,0,5000,4077.75,1522.69,2555.06,2085.33,0,60000,48933,18272.23,30660.77,25023.98,0,1.51,0.33841814641446483,"PASS",1.22,0.41706636043530515,"PASS",300000,"Pass","Y","2023-10-25T09:24:06",null,"Case 49","Neil "]
[300000,5.3999999999999999E-2,7.9000000000000001E-2,30,0,300000,5.3999999999999999E-2,7.9000000000000001E-2,30,0,null,null,null,null,null,"Individual (Single)","Individual (Single)","","","","","","","","","","","","","","","","",45000,45000,0,0,0,0,0,0,0,0,0,0,0,0,0,0,0,0,0,0,0,0,0,0,0,0,0,0,0,0,0,0,0,0,0,0,0,0,0,0,0,0,100,100,100,100,100,100,500,10,100,100,0,100,500,0,300,0,"Yes","No","No","Yes","Yes","Yes","Yes","Yes","Yes","Yes","No","Yes","Yes","No","No","No",0,0,0,0,5992,5992,0,0,0,0,39333,39333,0,0,0,0,78666,16503.240000000002,16503.240000000002,0,0,0,0,33006.49,26520,39006.49,39659.51,5.5E-2,0.02,3.8199999999999998E-2,6.0400000000000002E-2,1.25,0.8,0.25,7500,6555.5,3250.54,3304.96,1684.59,0,90000,78666,39006.49,39659.51,20215.11,0,7500,6555.5,3250.54,3304.96,2077.14,0,90000,78666,39006.49,39659.51,24925.67,0,1.96,0.22461231674784571,"PASS",1.59,0.276951920023634,"PASS",300000,5992,5992,0,0,0,0,39333,39333,0,0,0,0,78666,16503.240000000002,16503.240000000002,0,0,0,0,33006.49,26520,39006.49,39659.51,5.5E-2,0.02,3.8199999999999998E-2,6.0400000000000002E-2,1.25,0.8,0.25,7500,6555.5,3250.54,3304.96,1684.59,0,90000,78666,39006.49,39659.51,20215.11,0,7500,6555.5,3250.54,3304.96,2077.14,0,90000,78666,39006.49,39659.51,24925.67,0,1.96,0.22461231674784571,"PASS",1.59,0.276951920023634,"PASS",300000,"Pass","Y","2023-10-25T09:24:08",null,"Case 50","Neil "]
[300000,5.3999999999999999E-2,7.9000000000000001E-2,30,0,300000,5.3999999999999999E-2,7.9000000000000001E-2,30,0,null,null,null,null,null,"Individual (Single)","Individual (Single)","","","","","","","","","","","","","","","","",45000,25000,0,0,0,0,0,0,0,0,0,0,0,0,0,0,0,0,0,0,0,0,0,0,0,0,0,0,0,0,0,0,0,0,0,0,0,0,0,0,0,0,100,100,100,100,100,100,500,10,100,100,0,100,500,0,300,0,"Yes","No","No","Yes","Yes","Yes","Yes","Yes","Yes","Yes","No","Yes","Yes","No","No","No",0,0,0,0,5992,1455.5,0,0,0,0,39333,24244.5,0,0,0,0,63577.5,16503.240000000002,15787.04,0,0,0,0,32290.28,26520,38290.28,25287.22,5.5E-2,0.02,3.8199999999999998E-2,6.0400000000000002E-2,1.25,0.8,0.25,5833.33,5298.13,3190.86,2107.27,1684.59,0,70000,63577.5,38290.28,25287.22,20215.11,0,5833.33,5298.13,3190.86,2107.27,2077.14,0,70000,63577.5,38290.28,25287.22,24925.67,0,1.25,0.28878726439008734,"PASS",1.01,0.3560810400303866,"PASS",300000,5992,1455.5,0,0,0,0,39333,24244.5,0,0,0,0,63577.5,16503.240000000002,15787.04,0,0,0,0,32290.28,26520,38290.28,25287.22,5.5E-2,0.02,3.8199999999999998E-2,6.0400000000000002E-2,1.25,0.8,0.25,5833.33,5298.13,3190.86,2107.27,1684.59,0,70000,63577.5,38290.28,25287.22,20215.11,0,5833.33,5298.13,3190.86,2107.27,2077.14,0,70000,63577.5,38290.28,25287.22,24925.67,0,1.25,0.28878726439008734,"PASS",1.01,0.3560810400303866,"PASS",300000,"Pass","Y","2023-10-25T09:24:11",null,"Case 51","Neil "]
[300000,0.02,5.8500000000000003E-2,30,0,300000,0.02,5.8500000000000003E-2,30,0,null,null,null,null,null,"Individual (Single)","","","","","","","","","","","","","","","","","",80000,0,0,0,0,0,0,0,0,0,0,0,0,0,0,0,0,0,0,0,0,0,0,0,0,0,0,0,0,0,0,0,0,0,0,0,0,0,0,0,0,0,1,1,1,1,100,50,60,50,20,1,0,1,45,0,60,0,"Yes","No","No","Yes","Yes","Yes","Yes","Yes","Yes","Yes","No","Yes","Yes","No","No","No",0,0,0,0,18067,0,0,0,0,0,61933,0,0,0,0,0,61933,22426.95,0,0,0,0,0,22426.95,4692,23170.95,38762.050000000003,5.5E-2,0.02,3.8199999999999998E-2,6.0400000000000002E-2,1.25,0.8,0.25,6666.67,5161.08,1930.91,3230.17,1108.8599999999999,0,80000,61933,23170.95,38762.050000000003,13306.3,0,6666.67,5161.08,1930.91,3230.17,1703.37,0,80000,61933,23170.95,38762.050000000003,20440.400000000001,0,2.91,0.16632876270996924,"PASS",1.89,0.25550505060615131,"PASS",300000,18067,0,0,0,0,0,61933,0,0,0,0,0,61933,22426.95,0,0,0,0,0,22426.95,4692,23170.95,38762.050000000003,5.5E-2,0.02,3.8199999999999998E-2,6.0400000000000002E-2,1.25,0.8,0.25,6666.67,5161.08,1930.91,3230.17,1108.8599999999999,0,80000,61933,23170.95,38762.050000000003,13306.3,0,6666.67,5161.08,1930.91,3230.17,1703.37,0,80000,61933,23170.95,38762.050000000003,20440.400000000001,0,2.91,0.16632876270996924,"PASS",1.89,0.25550505060615131,"PASS",300000,"Pass","Y","2023-10-25T09:24:13",null,"Case 52","Neil "]
[300000,0.03,5.8500000000000003E-2,30,0,300000,0.03,5.8500000000000003E-2,30,0,null,null,null,null,null,"Individual (Single)","","","","","","","","","","","","","","","","","",60000,0,0,0,0,0,0,0,0,0,0,0,0,0,0,0,0,0,0,0,0,0,0,0,0,0,0,0,0,0,0,0,0,0,0,0,0,0,0,0,0,0,1,1,1,1,100,50,60,50,20,1,0,1,45,0,60,0,"Yes","No","No","Yes","Yes","Yes","Yes","Yes","Yes","Yes","No","Yes","Yes","No","No","No",0,0,0,0,11167,0,0,0,0,0,48933,0,0,0,0,0,48933,17528.23,0,0,0,0,0,17528.23,4692,18272.23,30660.77,5.5E-2,0.02,3.8199999999999998E-2,6.0400000000000002E-2,1.25,0.8,0.25,5000,4077.75,1522.69,2555.06,1264.81,0,60000,48933,18272.23,30660.77,15177.75,0,5000,4077.75,1522.69,2555.06,1703.37,0,60000,48933,18272.23,30660.77,20440.400000000001,0,2.02,0.25296242023767029,"PASS",1.5,0.34067340080820169,"PASS",300000,11167,0,0,0,0,0,48933,0,0,0,0,0,48933,17528.23,0,0,0,0,0,17528.23,4692,18272.23,30660.77,5.5E-2,0.02,3.8199999999999998E-2,6.0400000000000002E-2,1.25,0.8,0.25,5000,4077.75,1522.69,2555.06,1264.81,0,60000,48933,18272.23,30660.77,15177.75,0,5000,4077.75,1522.69,2555.06,1703.37,0,60000,48933,18272.23,30660.77,20440.400000000001,0,2.02,0.25296242023767029,"PASS",1.5,0.34067340080820169,"PASS",300000,"Pass","Y","2023-10-25T09:24:15",null,"Case 53","Neil "]
[300000,3.3399999999999999E-2,5.8500000000000003E-2,30,0,300000,3.3399999999999999E-2,5.8500000000000003E-2,30,0,null,null,null,null,null,"Individual (Single)","Individual (Single)","","","","","","","","","","","","","","","","",45000,45000,0,0,0,0,0,0,0,0,0,0,0,0,0,0,0,0,0,0,0,0,0,0,0,0,0,0,0,0,0,0,0,0,0,0,0,0,0,0,0,0,100,100,100,100,100,100,500,10,100,100,0,100,500,0,300,0,"Yes","No","No","Yes","Yes","Yes","Yes","Yes","Yes","Yes","No","Yes","Yes","No","No","No",0,0,0,0,5992,5992,0,0,0,0,39333,39333,0,0,0,0,78666,16503.240000000002,16503.240000000002,0,0,0,0,33006.49,26520,39006.49,39659.51,5.5E-2,0.02,3.8199999999999998E-2,6.0400000000000002E-2,1.25,0.8,0.25,7500,6555.5,3250.54,3304.96,1320.48,0,90000,78666,39006.49,39659.51,15845.8,0,7500,6555.5,3250.54,3304.96,1703.37,0,90000,78666,39006.49,39659.51,20440.400000000001,0,2.5,0.17606444647275668,"PASS",1.94,0.22711560053880114,"PASS",300000,5992,5992,0,0,0,0,39333,39333,0,0,0,0,78666,16503.240000000002,16503.240000000002,0,0,0,0,33006.49,26520,39006.49,39659.51,5.5E-2,0.02,3.8199999999999998E-2,6.0400000000000002E-2,1.25,0.8,0.25,7500,6555.5,3250.54,3304.96,1320.48,0,90000,78666,39006.49,39659.51,15845.8,0,7500,6555.5,3250.54,3304.96,1703.37,0,90000,78666,39006.49,39659.51,20440.400000000001,0,2.5,0.17606444647275668,"PASS",1.94,0.22711560053880114,"PASS",300000,"Pass","Y","2023-10-25T09:24:18",null,"Case 54","Neil "]
[300000,3.3599999999999998E-2,5.8599999999999999E-2,30,0,300000,3.3599999999999998E-2,5.8599999999999999E-2,30,0,null,null,null,null,null,"Individual (Single)","Individual (Single)","","","","","","","","","","","","","","","","",45000,25000,0,0,0,0,0,0,0,0,0,0,0,0,0,0,0,0,0,0,0,0,0,0,0,0,0,0,0,0,0,0,0,0,0,0,0,0,0,0,0,0,100,100,100,100,100,100,500,10,100,100,0,100,500,0,300,0,"Yes","No","No","Yes","Yes","Yes","Yes","Yes","Yes","Yes","No","Yes","Yes","No","No","No",0,0,0,0,5992,1455.5,0,0,0,0,39333,24244.5,0,0,0,0,63577.5,16503.240000000002,15787.04,0,0,0,0,32290.28,26520,38290.28,25287.22,5.5E-2,0.02,3.8199999999999998E-2,6.0400000000000002E-2,1.25,0.8,0.25,5833.33,5298.13,3190.86,2107.27,1323.8,0,70000,63577.5,38290.28,25287.22,15885.59,0,5833.33,5298.13,3190.86,2107.27,1703.37,0,70000,63577.5,38290.28,25287.22,20440.400000000001,0,1.59,0.226936965201672,"PASS",1.23,0.29200577212131573,"PASS",300000,5992,1455.5,0,0,0,0,39333,24244.5,0,0,0,0,63577.5,16503.240000000002,15787.04,0,0,0,0,32290.28,26520,38290.28,25287.22,5.5E-2,0.02,3.8199999999999998E-2,6.0400000000000002E-2,1.25,0.8,0.25,5833.33,5298.13,3190.86,2107.27,1323.8,0,70000,63577.5,38290.28,25287.22,15885.59,0,5833.33,5298.13,3190.86,2107.27,1703.37,0,70000,63577.5,38290.28,25287.22,20440.400000000001,0,1.59,0.226936965201672,"PASS",1.23,0.29200577212131573,"PASS",300000,"Pass","Y","2023-10-25T09:24:20",null,"Case 55","Neil "]
[1200000,4.7625000000000001E-2,7.2624999999999995E-2,30,3,500000,4.4999999999999998E-2,7.0000000000000007E-2,30,3,700000,null,7.4500000000000011E-2,20,0,"Individual (Single)","","","","","","","","","","","","","","","","","",100000,0,0,0,0,0,0,0,0,0,0,0,0,0,0,0,0,0,0,0,0,0,0,0,0,0,0,0,0,0,0,0,0,0,0,0,0,0,0,0,0,0,100,100,100,100,100,100,500,10,100,100,0,100,500,0,300,0,"Yes","No","No","Yes","Yes","Yes","Yes","Yes","Yes","Yes","No","Yes","Yes","No","No","No",0,0,0,0,24967,0,0,0,0,0,75033,0,0,0,0,0,75033,26566.720000000001,0,0,0,0,0,26566.720000000001,26520,32566.720000000001,42466.28,5.5E-2,0.02,3.8199999999999998E-2,6.0400000000000002E-2,1.25,0.8,0.25,8333.33,6252.75,2713.89,3538.86,5585.27,0,100000,75033,32566.720000000001,42466.28,67023.23,0,8333.33,6252.75,2713.89,3538.86,8092.99,0,100000,75033,32566.720000000001,42466.28,97115.83,0,0.63,0.67023229262921435,"FAIL",0.43,0.97115832200294416,"FAIL",552427.03,24967,0,0,0,0,0,75033,0,0,0,0,0,75033,26566.720000000001,0,0,0,0,0,26566.720000000001,26520,32566.720000000001,42466.28,5.5E-2,0.02,3.8199999999999998E-2,6.0400000000000002E-2,1.25,0.8,0.25,8333.33,6252.75,2713.89,3538.86,5585.27,0,100000,75033,32566.720000000001,42466.28,67023.23,0,8333.33,6252.75,2713.89,3538.86,8092.99,0,100000,75033,32566.720000000001,42466.28,97115.83,0,0.63,0.67023229262921435,"FAIL",0.43,0.97115832200294416,"FAIL",552427.03,"Pass","Y","2023-10-25T09:24:23",null,"Case 56","Neil "]
[1600000,3.0062499999999999E-2,5.50625E-2,30,5,1000000,3.2500000000000001E-2,5.7500000000000002E-2,30,5,600000,null,5.5E-2,30,0,"Individual (Single)","","","","","","","","","","","","","","","","","",100000,0,0,0,0,0,0,0,0,0,0,0,0,0,0,0,0,0,0,0,0,0,0,0,0,0,0,0,0,0,0,0,0,0,0,0,0,0,0,0,0,0,100,100,100,100,100,100,500,10,100,100,0,100,500,0,300,0,"Yes","No","No","Yes","Yes","Yes","Yes","Yes","Yes","Yes","No","Yes","Yes","No","No","No",0,0,0,0,24967,0,0,0,0,0,75033,0,0,0,0,0,75033,26566.720000000001,0,0,0,0,0,26566.720000000001,26520,32566.720000000001,42466.28,5.5E-2,0.02,3.8199999999999998E-2,6.0400000000000002E-2,1.25,0.8,0.25,8333.33,6252.75,2713.89,3538.86,6539.83,0,100000,75033,32566.720000000001,42466.28,78477.95,0,8333.33,6252.75,2713.89,3538.86,9547.61,0,100000,75033,32566.720000000001,42466.28,114571.31,0,0.54,0.784779470407998,"FAIL",0.37,1.1457130717076065,"FAIL",595282.22,24967,0,0,0,0,0,75033,0,0,0,0,0,75033,26566.720000000001,0,0,0,0,0,26566.720000000001,26520,32566.720000000001,42466.28,5.5E-2,0.02,3.8199999999999998E-2,6.0400000000000002E-2,1.25,0.8,0.25,8333.33,6252.75,2713.89,3538.86,6539.83,0,100000,75033,32566.720000000001,42466.28,78477.95,0,8333.33,6252.75,2713.89,3538.86,9547.61,0,100000,75033,32566.720000000001,42466.28,114571.31,0,0.54,0.784779470407998,"FAIL",0.37,1.1457130717076065,"FAIL",595282.22,"Pass","Y","2023-10-25T09:24:25",null,"Case 57","Neil "]
[700000,5.1071428571428573E-2,7.6071428571428568E-2,35,0,250000,4.3999999999999997E-2,6.9000000000000006E-2,25,0,450000,null,0.08,35,0,"Individual (Single)","","","","","","","","","","","","","","","","","",100000,0,0,0,0,0,0,0,0,0,0,0,0,0,0,0,0,0,0,0,0,0,0,0,0,0,0,0,0,0,0,0,0,0,0,0,0,0,0,0,0,0,100,100,100,100,100,100,500,10,100,100,0,100,500,0,300,0,"Yes","No","No","Yes","Yes","Yes","Yes","Yes","Yes","Yes","No","Yes","Yes","No","No","No",0,0,0,0,24967,0,0,0,0,0,75033,0,0,0,0,0,75033,26566.720000000001,0,0,0,0,0,26566.720000000001,26520,32566.720000000001,42466.28,5.5E-2,0.02,3.8199999999999998E-2,6.0400000000000002E-2,1.25,0.8,0.25,8333.33,6252.75,2713.89,3538.86,2446.86,0,100000,75033,32566.720000000001,42466.28,29362.29,0,8333.33,6252.75,2713.89,3538.86,4089,0,100000,75033,32566.720000000001,42466.28,49068.04,0,1.44,0.29362294395318916,"PASS",0.86,0.49068035378577335,"FAIL",634338.66,24967,0,0,0,0,0,75033,0,0,0,0,0,75033,26566.720000000001,0,0,0,0,0,26566.720000000001,26520,32566.720000000001,42466.28,5.5E-2,0.02,3.8199999999999998E-2,6.0400000000000002E-2,1.25,0.8,0.25,8333.33,6252.75,2713.89,3538.86,2446.86,0,100000,75033,32566.720000000001,42466.28,29362.29,0,8333.33,6252.75,2713.89,3538.86,4089,0,100000,75033,32566.720000000001,42466.28,49068.04,0,1.44,0.29362294395318916,"PASS",0.86,0.49068035378577335,"FAIL",634338.66,"Pass","Y","2023-10-25T09:24:28",null,"Case 58","Neil "]
[450000,4.8333333333333332E-2,7.3333333333333334E-2,40,5,150000,5.5E-2,0.08,40,0,300000,null,7.0000000000000007E-2,30,5,"Individual (Single)","","","","","","","","","","","","","","","","","",100000,0,0,0,0,0,0,0,0,0,0,0,0,0,0,0,0,0,0,0,0,0,0,0,0,0,0,0,0,0,0,0,0,0,0,0,0,0,0,0,0,0,100,100,100,100,100,100,500,10,100,100,0,100,500,0,300,0,"Yes","No","No","Yes","Yes","Yes","Yes","Yes","Yes","Yes","No","Yes","Yes","No","No","No",0,0,0,0,24967,0,0,0,0,0,75033,0,0,0,0,0,75033,26566.720000000001,0,0,0,0,0,26566.720000000001,26520,32566.720000000001,42466.28,5.5E-2,0.02,3.8199999999999998E-2,6.0400000000000002E-2,1.25,0.8,0.25,8333.33,6252.75,2713.89,3538.86,1773.66,0,100000,75033,32566.720000000001,42466.28,21283.87,0,8333.33,6252.75,2713.89,3538.86,2829.37,0,100000,75033,32566.720000000001,42466.28,33952.42,0,1.99,0.21283865063827959,"PASS",1.25,0.33952422822337108,"PASS",450000,24967,0,0,0,0,0,75033,0,0,0,0,0,75033,26566.720000000001,0,0,0,0,0,26566.720000000001,26520,32566.720000000001,42466.28,5.5E-2,0.02,3.8199999999999998E-2,6.0400000000000002E-2,1.25,0.8,0.25,8333.33,6252.75,2713.89,3538.86,1773.66,0,100000,75033,32566.720000000001,42466.28,21283.87,0,8333.33,6252.75,2713.89,3538.86,2829.37,0,100000,75033,32566.720000000001,42466.28,33952.42,0,1.99,0.21283865063827959,"PASS",1.25,0.33952422822337108,"PASS",450000,"Pass","Y","2023-10-25T09:24:30",null,"Case 59","Neil "]
[2250000,3.0111111111111113E-2,5.5111111111111111E-2,30,5,2000000,2.9499999999999998E-2,5.5E-2,30,0,250000,null,6.0000000000000005E-2,30,5,"Individual (Single)","","","","","","","","","","","","","","","","","",100000,0,0,0,0,0,0,0,0,0,0,0,0,0,0,0,0,0,0,0,0,0,0,0,0,0,0,0,0,0,0,0,0,0,0,0,0,0,0,0,0,0,100,100,100,100,100,100,500,10,100,100,0,100,500,0,300,0,"Yes","No","No","Yes","Yes","Yes","Yes","Yes","Yes","Yes","No","Yes","Yes","No","No","No",0,0,0,0,24967,0,0,0,0,0,75033,0,0,0,0,0,75033,26566.720000000001,0,0,0,0,0,26566.720000000001,26520,32566.720000000001,42466.28,5.5E-2,0.02,3.8199999999999998E-2,6.0400000000000002E-2,1.25,0.8,0.25,8333.33,6252.75,2713.89,3538.86,9211.58,0,100000,75033,32566.720000000001,42466.28,110538.93,0,8333.33,6252.75,2713.89,3538.86,12891,0,100000,75033,32566.720000000001,42466.28,154691.99,0,0.38,1.1053892921027737,"FAIL",0.27,1.5469198509172482,"FAIL",618512.4,24967,0,0,0,0,0,75033,0,0,0,0,0,75033,26566.720000000001,0,0,0,0,0,26566.720000000001,26520,32566.720000000001,42466.28,5.5E-2,0.02,3.8199999999999998E-2,6.0400000000000002E-2,1.25,0.8,0.25,8333.33,6252.75,2713.89,3538.86,9211.58,0,100000,75033,32566.720000000001,42466.28,110538.93,0,8333.33,6252.75,2713.89,3538.86,12891,0,100000,75033,32566.720000000001,42466.28,154691.99,0,0.38,1.1053892921027737,"FAIL",0.27,1.5469198509172482,"FAIL",618512.4,"Pass","Y","2023-10-25T09:24:33",null,"Case 60","Neil "]
[1850000,4.5783783783783782E-2,7.0783783783783777E-2,30,5,1100000,3.95E-2,6.4500000000000002E-2,30,5,750000,null,0.08,15,0,"Individual (Single)","","","","","","","","","","","","","","","","","",100000,0,0,0,0,0,0,0,0,0,0,0,0,0,0,0,0,0,0,0,0,0,0,0,0,0,0,0,0,0,0,0,0,0,0,0,0,0,0,0,0,0,100,100,100,100,100,100,500,10,100,100,0,100,500,0,300,0,"Yes","No","No","Yes","Yes","Yes","Yes","Yes","Yes","Yes","No","Yes","Yes","No","No","No",0,0,0,0,24967,0,0,0,0,0,75033,0,0,0,0,0,75033,26566.720000000001,0,0,0,0,0,26566.720000000001,26520,32566.720000000001,42466.28,5.5E-2,0.02,3.8199999999999998E-2,6.0400000000000002E-2,1.25,0.8,0.25,8333.33,6252.75,2713.89,3538.86,9942.5499999999993,0,100000,75033,32566.720000000001,42466.28,119310.56,0,8333.33,6252.75,2713.89,3538.86,13181.86,0,100000,75033,32566.720000000001,42466.28,158182.31,0,0.35,1.1931055793818068,"FAIL",0.26,1.5818230802962947,"FAIL",527358.80000000005,24967,0,0,0,0,0,75033,0,0,0,0,0,75033,26566.720000000001,0,0,0,0,0,26566.720000000001,26520,32566.720000000001,42466.28,5.5E-2,0.02,3.8199999999999998E-2,6.0400000000000002E-2,1.25,0.8,0.25,8333.33,6252.75,2713.89,3538.86,9942.5499999999993,0,100000,75033,32566.720000000001,42466.28,119310.56,0,8333.33,6252.75,2713.89,3538.86,13181.86,0,100000,75033,32566.720000000001,42466.28,158182.31,0,0.35,1.1931055793818068,"FAIL",0.26,1.5818230802962947,"FAIL",527358.80000000005,"Pass","Y","2023-10-25T09:24:35",null,"Case 61","Neil "]
[489000,4.9911656441717793E-2,7.4911656441717794E-2,30,0,346000,5.5E-2,0.08,10,0,143000,null,6.2600000000000003E-2,30,0,"Individual (Single)","","","","","","","","","","","",2,"","","","","",55000,0,0,0,0,0,0,0,0,0,0,0,0,0,0,0,0,0,0,0,0,0,0,0,0,0,0,0,0,0,0,0,0,0,0,0,0,0,0,0,0,0,1,1,1,1,1,1,1,1,1,1,0,1,1,0,1,0,"Yes","No","No","Yes","Yes","Yes","Yes","Yes","Yes","Yes","No","Yes","Yes","No","No","No",0,2000,0,0,9442,0,0,0,0,0,45733,0,0,0,0,0,45733,28693.55,0,0,0,0,0,28693.55,156,28729.55,17003.45,5.5E-2,0.02,3.8199999999999998E-2,6.0400000000000002E-2,1.25,0.8,0.25,4583.33,3811.08,2394.13,1416.95,4152.2299999999996,76.400000000000006,55000,45733,28729.55,17003.45,49826.78,916.8,4583.33,3811.08,2394.13,1416.95,4919.0200000000004,76.400000000000006,55000,45733,28729.55,17003.45,59028.23,916.8,0.33,0.92261049592469579,"FAIL",0.28000000000000003,1.0899097056058407,"FAIL",165401.49,9442,0,0,0,0,0,45733,0,0,0,0,0,45733,28693.55,0,0,0,0,0,28693.55,156,28729.55,17003.45,5.5E-2,0.02,3.8199999999999998E-2,6.0400000000000002E-2,1.25,0.8,0.25,4583.33,3811.08,2394.13,1416.95,4152.2299999999996,76.400000000000006,55000,45733,28729.55,17003.45,49826.78,916.8,4583.33,3811.08,2394.13,1416.95,4919.0200000000004,76.400000000000006,55000,45733,28729.55,17003.45,59028.23,916.8,0.33,0.92261049592469579,"FAIL",0.28000000000000003,1.0899097056058407,"FAIL",165401.49,"Pass","Y","2023-10-25T09:24:38",null,"Case 62","Neil "]
[355000,3.0394366197183099E-2,5.5394366197183104E-2,30,5,145000,4.3999999999999997E-2,6.9000000000000006E-2,25,5,210000,null,5.5E-2,30,0,"Individual (Single)","","","","","","","","","","","",2,"","","","","",55000,0,0,0,0,0,0,0,0,0,0,0,0,0,0,0,0,0,0,0,0,0,0,0,0,0,0,0,0,0,0,0,0,0,0,0,0,0,0,0,0,0,1,1,1,1,1,1,1,1,1,1,0,1,1,0,1,0,"Yes","No","No","Yes","Yes","Yes","Yes","Yes","Yes","Yes","No","Yes","Yes","No","No","No",0,2000,0,0,9442,0,0,0,0,0,45733,0,0,0,0,0,45733,28693.55,0,0,0,0,0,28693.55,156,28729.55,17003.45,5.5E-2,0.02,3.8199999999999998E-2,6.0400000000000002E-2,1.25,0.8,0.25,4583.33,3811.08,2394.13,1416.95,1492.87,76.400000000000006,55000,45733,28729.55,17003.45,17914.400000000001,916.8,4583.33,3811.08,2394.13,1416.95,2264.92,76.400000000000006,55000,45733,28729.55,17003.45,27179.02,916.8,0.9,0.34238540492763758,"FAIL",0.6,0.51083309299605828,"FAIL",221843.19,9442,0,0,0,0,0,45733,0,0,0,0,0,45733,28693.55,0,0,0,0,0,28693.55,156,28729.55,17003.45,5.5E-2,0.02,3.8199999999999998E-2,6.0400000000000002E-2,1.25,0.8,0.25,4583.33,3811.08,2394.13,1416.95,1492.87,76.400000000000006,55000,45733,28729.55,17003.45,17914.400000000001,916.8,4583.33,3811.08,2394.13,1416.95,2264.92,76.400000000000006,55000,45733,28729.55,17003.45,27179.02,916.8,0.9,0.34238540492763758,"FAIL",0.6,0.51083309299605828,"FAIL",221843.19,"Pass","Y","2023-10-25T09:24:40",null,"Case 63","Neil "]

{"sheet":"Commercial","index":3,"n_rows":89,"n_cols":17,"rows_kept":89,"cut":false,"hidden":false,"merged":[[7,12,7,13],[31,2,32,2],[3,4,3,8],[88,8,88,10],[87,8,87,10],[53,6,53,8],[54,6,54,8],[55,6,55,8],[56,6,56,8],[57,6,57,8]]}
[null,"Commercial Servicability Calculator"]
[null,null,{"$f":"Residential!C3","v":"Version 6.4 31st October 2023"}]
[]
[null,null,"Applicant Name"]
[]
[null,null,"Proposed Loan Details"]
[]
[null,null,"New Loan Amount",null,null,null,"Interest Rate",null,null,null,"Assessment Rate",null,{"$f":"MAX(BaselineAssessmentRate,I8+AssessmentLoading)","v":5.5E-2}]
[null,null,"Documentation Type",null,null,null,"Loan Term (Years)"]
[null,null,null,null,null,null,"I/O Term (Years)"]
[null,null,null,null,null,null,"P&I Repayment",null,{"$f":"IF(I9>I10,-PMT(M8/12,12*(I9-I10),E8),0)","v":0}]
[null,null,null,null,null,null,"IO Repayment",null,{"$f":"IF(I10>0,E8*M8/12,0)","v":0}]
[]
[]
[null,null,"Business Loan Details",null,null,null,null,null,null,null,null,null,null,"excluding proposed Pepper loan"]
[]
[null,null,null,null,"Loan Amount",null,"Rate",null,"Actual Loan Repayment (Monthly)"]
[null,null,"Loan 1"]
[null,null,"Loan 2"]
[null,null,"Loan 3"]
[null,null,"Loan 4"]
[]
[]
[null,null,"Business Income / Expenses"]
[]
[null,null,"Business Income",null,null,null,null,null,"Add Backs"]
[null,null,"Net Profit Before Tax",null,null,null,null,null,"Depreciation"]
[null,null,"Proposed Net Commercial Rental Income",null,null,null,null,null,"Ammortisation"]
[null,null,"Proposed Gross Residential Rental Income",null,null,null,null,null,"Interest Paid"]
[null,null,null,null,null,null,null,null,"Directors Salaries/Fees/Super"]
[null,null,null,null,null,null,null,null,"Other"]
[null,null,"Earning Before Interest, Tax, Depreciation & Ammortisation (EBITDA)"]
[null,null,null,null,{"$f":"K33+E27+E28+(E29*RentalIncomeShading)","v":0},null,null,null," Total Add Backs",null,{"$f":"SUM(K27:K31)","v":0}]
[]
[]
[null,null,"Personal Income / Expenses"]
[]
[null,null,"Applicant Details",null,"Applicant 1",null,"Applicant 2",null,"Applicant 3",null,"Applicant 4"]
[null,null,"Status"]
[null,null,"Couple With"]
[null,null,"Dependants"]
[null,null,null,null,"Enter a Status",null,"Enter a Status",null,"Enter a Status",null,"Enter a Status"]
[]
[null,null,"Gross Annual Income"]
[null,null,"Untaxed Allowable Income"]
[null,null,"Gross Residential Rental Income (Other)"]
[null,null,"Total Income",null,{"$f":"E44+E45+E46*RentalIncomeShading","v":0},null,{"$f":"G44+G45+G46*RentalIncomeShading","v":0},null,{"$f":"I44+I45+I46*RentalIncomeShading","v":0},null,{"$f":"K44+K45+K46*RentalIncomeShading","v":0},null,null,null,null,{"$f":"(E47+G47+I47+K47)","v":0},"Total Gross Annual Income"]
[]
[null,null,"Investment Property Loan Balance (personal name)"]
[null,null,"Tax",null,{"$f":"VLOOKUP(E66,IncomeTaxTable,2,TRUE)+MAX(((E66-VLOOKUP(E66,IncomeTaxTable,1,TRUE))*VLOOKUP(E66,IncomeTaxTable,3,TRUE)),0) +IF(E66<=MinimumForPartialLevy,0,IF(E66>MinimumForFullLevy,E66*MedicareFullLevyPerc,(E66-MinimumForPartialLevy)*MedicarePartialLevyPerc))","v":0},null,{"$f":"VLOOKUP(G66,IncomeTaxTable,2,TRUE)+MAX(((G66-VLOOKUP(G66,IncomeTaxTable,1,TRUE))*VLOOKUP(G66,IncomeTaxTable,3,TRUE)),0) +IF(G66<=MinimumForPartialLevy,0,IF(G66>MinimumForFullLevy,G66*MedicareFullLevyPerc,(G66-MinimumForPartialLevy)*MedicarePartialLevyPerc))","v":0},null,{"$f":"VLOOKUP(I66,IncomeTaxTable,2,TRUE)+MAX(((I66-VLOOKUP(I66,IncomeTaxTable,1,TRUE))*VLOOKUP(I66,IncomeTaxTable,3,TRUE)),0) +IF(I66<=MinimumForPartialLevy,0,IF(I66>MinimumForFullLevy,I66*MedicareFullLevyPerc,(I66-MinimumForPartialLevy)*MedicarePartialLevyPerc))","v":0},null,{"$f":"VLOOKUP(K66,IncomeTaxTable,2,TRUE)+MAX(((K66-VLOOKUP(K66,IncomeTaxTable,1,TRUE))*VLOOKUP(K66,IncomeTaxTable,3,TRUE)),0) +IF(K66<=MinimumForPartialLevy,0,IF(K66>MinimumForFullLevy,K66*MedicareFullLevyPerc,(K66-MinimumForPartialLevy)*MedicarePartialLevyPerc))","v":0}]
[null,null,"Tax offset for Low Income Earners",null,{"$f":"0-(IF(OR(E39=\"Company\",E66=\"\",E66=0),0,IF(VLOOKUP(E66,TaxOffsetForLowIncomeTable,2,TRUE)+(E66-VLOOKUP(E66,TaxOffsetForLowIncomeTable,1,TRUE))*VLOOKUP(E66,TaxOffsetForLowIncomeTable,3,TRUE)<0,0,VLOOKUP(E66,TaxOffsetForLowIncomeTable,2,TRUE)+(E66-VLOOKUP(E66,TaxOffsetForLowIncomeTable,1,TRUE))*VLOOKUP(E66,TaxOffsetForLowIncomeTable,3,TRUE))))","v":0},null,{"$f":"0-(IF(OR(G39=\"Company\",G66=\"\",G66=0),0,IF(VLOOKUP(G66,TaxOffsetForLowIncomeTable,2,TRUE)+(G66-VLOOKUP(G66,TaxOffsetForLowIncomeTable,1,TRUE))*VLOOKUP(G66,TaxOffsetForLowIncomeTable,3,TRUE)<0,0,VLOOKUP(G66,TaxOffsetForLowIncomeTable,2,TRUE)+(G66-VLOOKUP(G66,TaxOffsetForLowIncomeTable,1,TRUE))*VLOOKUP(G66,TaxOffsetForLowIncomeTable,3,TRUE))))","v":0},null,{"$f":"0-(IF(OR(I39=\"Company\",I66=\"\",I66=0),0,IF(VLOOKUP(I66,TaxOffsetForLowIncomeTable,2,TRUE)+(I66-VLOOKUP(I66,TaxOffsetForLowIncomeTable,1,TRUE))*VLOOKUP(I66,TaxOffsetForLowIncomeTable,3,TRUE)<0,0,VLOOKUP(I66,TaxOffsetForLowIncomeTable,2,TRUE)+(I66-VLOOKUP(I66,TaxOffsetForLowIncomeTable,1,TRUE))*VLOOKUP(I66,TaxOffsetForLowIncomeTable,3,TRUE))))","v":0},null,{"$f":"0-(IF(OR(K39=\"Company\",K66=\"\",K66=0),0,IF(VLOOKUP(K66,TaxOffsetForLowIncomeTable,2,TRUE)+(K66-VLOOKUP(K66,TaxOffsetForLowIncomeTable,1,TRUE))*VLOOKUP(K66,TaxOffsetForLowIncomeTable,3,TRUE)<0,0,VLOOKUP(K66,TaxOffsetForLowIncomeTable,2,TRUE)+(K66-VLOOKUP(K66,TaxOffsetForLowIncomeTable,1,TRUE))*VLOOKUP(K66,TaxOffsetForLowIncomeTable,3,TRUE))))","v":0}]
[null,null,"Net Income",null,{"$f":"E47-(IF(E50+E51>0,E50+E51,0))","v":0},null,{"$f":"G47-(IF(G50+G51>0,G50+G51,0))","v":0},null,{"$f":"I47-(IF(I50+I51>0,I50+I51,0))","v":0},null,{"$f":"K47-(IF(K50+K51>0,K50+K51,0))","v":0},null,null,null,null,{"$f":"(E52+G52+I52+K52)","v":0},"Total Net Annual Income"]
[]
[null,null,"Living Expenses (monthly)",null,null,null,"Other Commitments",null,null,null,"Per Month"]
[null,null,"Declared Living Expenses",null,null,null,"Rent/Board"]
[null,null,null,null,null,null,"Total Credit Card Limit",null,null,null,null,null,"3%:",{"$f":"K56*CreditCardCommitments","v":0}]
[null,null,null,null,null,null,"Personal Mortgage Repayments"]
[null,null,null,null,null,null,"Other Consumer Debt"]
[]
[null,null,"Is an Applicant",null,{"$f":"OR(E39<>\"\")","v":false},null,{"$f":"OR(G39<>\"\")","v":false},null,{"$f":"OR(I39<>\"\")","v":false},null,{"$f":"OR(K39<>\"\")","v":false}]
[null,null,"Spouse Dependants",null,{"$f":"IFERROR(HLOOKUP(E40,CREApplicantDetailsTable,4,FALSE),0)","v":0},null,{"$f":"IFERROR(HLOOKUP(G40,CREApplicantDetailsTable,4,FALSE),0)","v":0},null,{"$f":"IFERROR(HLOOKUP(I40,CREApplicantDetailsTable,4,FALSE),0)","v":0},null,{"$f":"IFERROR(HLOOKUP(K40,CREApplicantDetailsTable,4,FALSE),0)","v":0}]
[null,null,"Pepper Status Code",null,{"$f":"IF(E$39=\"Individual (Couple)\",\"P-C\",IF(E$39=\"Individual (Single)\",\"P-S\",\"\"))","v":""},null,{"$f":"IF(G$39=\"Individual (Couple)\",\"P-C\",IF(G$39=\"Individual (Single)\",\"P-S\",\"\"))","v":""},null,{"$f":"IF(I$39=\"Individual (Couple)\",\"P-C\",IF(I$39=\"Individual (Single)\",\"P-S\",\"\"))","v":""},null,{"$f":"IF(K$39=\"Individual (Couple)\",\"P-C\",IF(K$39=\"Individual (Single)\",\"P-S\",\"\"))","v":""}]
[null,null,"Pepper Dependents Code",null,{"$f":"IF(E$39=\"Individual (Couple)\",\"P-CD\"&INDEX(Validation!$B$21:$B$26,MATCH((E$41+E$61),Validation!$A$21:$A$26,1)),IF(E$39=\"Individual (Single)\",\"P-SD\"&INDEX(Validation!$B$21:$B$26,MATCH((E$41+E$61),Validation!$A$21:$A$26,1)),\"\"))","v":""},null,{"$f":"IF(G$39=\"Individual (Couple)\",\"P-CD\"&INDEX(Validation!$B$21:$B$26,MATCH((G$41+G$61),Validation!$A$21:$A$26,1)),IF(G$39=\"Individual (Single)\",\"P-SD\"&INDEX(Validation!$B$21:$B$26,MATCH((G$41+G$61),Validation!$A$21:$A$26,1)),\"\"))","v":""},null,{"$f":"IF(I$39=\"Individual (Couple)\",\"P-CD\"&INDEX(Validation!$B$21:$B$26,MATCH((I$41+I$61),Validation!$A$21:$A$26,1)),IF(I$39=\"Individual (Single)\",\"P-SD\"&INDEX(Validation!$B$21:$B$26,MATCH((I$41+I$61),Validation!$A$21:$A$26,1)),\"\"))","v":""},null,{"$f":"IF(K$39=\"Individual (Couple)\",\"P-CD\"&INDEX(Validation!$B$21:$B$26,MATCH((K$41+K$61),Validation!$A$21:$A$26,1)),IF(K$39=\"Individual (Single)\",\"P-SD\"&INDEX(Validation!$B$21:$B$26,MATCH((K$41+K$61),Validation!$A$21:$A$26,1)),\"\"))","v":""}]
[null,null,"Exclude for LE calc",null,{"$f":"IFERROR(IF(MATCH(E40,$E$38:$K$38,0)<(COLUMN()-COLUMN($E$38:$K$38)+1),TRUE,FALSE),FALSE)","v":false},null,{"$f":"IFERROR(IF(MATCH(G40,$E$38:$K$38,0)<(COLUMN()-COLUMN($E$38:$K$38)+1),TRUE,FALSE),FALSE)","v":false},null,{"$f":"IFERROR(IF(MATCH(I40,$E$38:$K$38,0)<(COLUMN()-COLUMN($E$38:$K$38)+1),TRUE,FALSE),FALSE)","v":false},null,{"$f":"IFERROR(IF(MATCH(K40,$E$38:$K$38,0)<(COLUMN()-COLUMN($E$38:$K$38)+1),TRUE,FALSE),FALSE)","v":false}]
[]
[null,null,"Total Taxable Income",null,{"$f":"MAX(E44+E46*RentalIncomeShading-E49*WorkingsForNegativeGearing,0)","v":0},null,{"$f":"MAX(G44+G46*RentalIncomeShading-G49*WorkingsForNegativeGearing,0)","v":0},null,0,null,0,null,null,null,null,{"$f":"(E66+G66+I66+K66)","v":0},"Total Taxable Income"]
[null,null,"Spouse Income",null,{"$f":"IFERROR(HLOOKUP(E40,CREApplicantDetailsTable,7,FALSE),0)","v":0},null,{"$f":"IFERROR(HLOOKUP(G40,CREApplicantDetailsTable,7,FALSE),0)","v":0},null,{"$f":"IFERROR(HLOOKUP(I40,CREApplicantDetailsTable,7,FALSE),0)","v":0},null,{"$f":"IFERROR(HLOOKUP(K40,CREApplicantDetailsTable,7,FALSE),0)","v":0}]
[null,null,"Income Bracket",null,{"$f":"IFERROR(HLOOKUP(E44+E67,HemCombinedIncomeRange,3,TRUE),1)","v":1},null,{"$f":"IFERROR(HLOOKUP(G44+G67,HemCombinedIncomeRange,3,TRUE),1)","v":1},null,{"$f":"IFERROR(HLOOKUP(I44+I67,HemCombinedIncomeRange,3,TRUE),1)","v":1},null,{"$f":"IFERROR(HLOOKUP(K44+K67,HemCombinedIncomeRange,3,TRUE),1)","v":1}]
[null,null,"HEM Living Expense",null,{"$f":"IFERROR(IF(AND(E60,NOT(E64)),(VLOOKUP(E62,HemTableForExpenses,E68+1,FALSE) +(VLOOKUP(E63,HemTableForExpenses,E68+1,FALSE))*(E41+E61))*NumberOfWeeksInAYear,0),0)","v":0},null,{"$f":"IFERROR(IF(AND(G60,NOT(G64)),(VLOOKUP(G62,HemTableForExpenses,G68+1,FALSE) +(VLOOKUP(G63,HemTableForExpenses,G68+1,FALSE))*(G41+G61))*NumberOfWeeksInAYear,0),0)","v":0},null,{"$f":"IFERROR(IF(AND(I60,NOT(I64)),(VLOOKUP(I62,HemTableForExpenses,I68+1,FALSE) +(VLOOKUP(I63,HemTableForExpenses,I68+1,FALSE))*(I41+I61))*NumberOfWeeksInAYear,0),0)","v":0},null,{"$f":"IFERROR(IF(AND(K60,NOT(K64)),(VLOOKUP(K62,HemTableForExpenses,K68+1,FALSE) +(VLOOKUP(K63,HemTableForExpenses,K68+1,FALSE))*(K41+K61))*NumberOfWeeksInAYear,0),0)","v":0},null,null,null,null,{"$f":"(E69+G69+I69+K69)","v":0},"HEM Living Expense"]
[null,null,null,null,null,null,null,null,null,null,null,null,null,null,null,{"$f":"E55*NumberOfMonthsInAYear","v":0},"Customer Nominated Living Expenses"]
[null,null,null,null,null,null,null,null,null,null,null,null,null,null,null,{"$f":"MAX(P69,P70)","v":0},"Used Living Expenses"]
[null,null,null,null,null,null,null,null,null,null,null,null,null,null,null,{"$f":"K55*NumberOfMonthsInAYear","v":0},"Personal rent"]
[null,null,null,null,null,null,null,null,null,null,null,null,null,null,null,{"$f":"(K57*OtherMortgageRepaymentBuffer+K58+N56)*NumberOfMonthsInAYear","v":0},"Personal Debt"]
[]
[]
[]
[]
[null,null,"Results"]
[]
[]
[null,null,"Business income (EBITDA + net personal contribution)",null,{"$f":"E33+P52-P71-P72-P73","v":0},null,"Interest Expenses",null,{"$f":"(E8*I8)+(E18*G18)+(E19*G19)+(E20*G20)+(E21*G21)","v":0}]
[null,null,null,null,null,null,"Debt Repayments",null,{"$f":"((SUM(I18:I21)+MAX(I11:I12))*12)","v":0}]
[]
[]
[null,null,null,null,null,null,"Interest Coverage Ratio (ICR):",null,{"$f":"IFERROR(E81/I81,0)","v":0}]
[null,null,null,null,null,null,"Debt Service Coverage Ratio (DSCR):",null,{"$f":"IFERROR(E81/I82,0)","v":0},null,{"$f":"IF(I89=\"INCOMPLETE\",\"INCOMPLETE\",IF(E9=FullDoc,IF(I86>=MinimumDSCRFullDoc,\"PASS\",\"FAIL\"),IF(E9=AltDoc,IF(I86>=MinimumDSCRAltDoc,\"PASS\",\"FAIL\"),IF(E9=LeaseDoc,IF(I86>=MinimumDSCRLeaseDoc,\"PASS\",\"FAIL\")))))","v":"INCOMPLETE"}]
[]
[null,null,null,null,null,null,null,null,"Application Status"]
[null,null,null,null,null,null,null,null,{"$f":"IF(OR(E8=\"\",I8=\"\",E9=\"\",I9=\"\",I9<I10),\"INCOMPLETE\",\"COMPLETE\")","v":"INCOMPLETE"}]

{"sheet":"SEIC","index":4,"n_rows":72,"n_cols":20,"rows_kept":72,"cut":false,"hidden":false,"merged":[[5,2,5,5],[5,13,5,16],[50,3,50,5],[45,3,45,5],[46,3,46,5],[47,3,47,5],[48,3,48,5],[49,3,49,5],[50,14,50,16],[49,14,49,16],[48,14,48,16],[45,14,45,16],[46,14,46,16],[47,14,47,16],[40,3,40,5],[37,3,37,5],[17,18,17,19],[36,14,36,16],[37,14,37,16],[17,7,17,8],[41,3,41,5],[36,3,36,5],[25,18,25,19],[38,14,38,16],[25,7,25,8],[39,14,39,16],[40,14,40,16],[41,14,41,16],[42,14,42,16],[38,3,38,5],[39,3,39,5],[44,14,44,15],[57,3,57,5],[42,3,42,5],[44,3,44,5]]}
[null,"Self-Employed Income Calculator"]
[]
[null,null,"Business 1",null,null,null,null,null,null,null,null,null,null,"Business 2"]
[]
[null,null,"Business Name",null,null,null,null,null,null,null,null,null,null,"Business Name"]
[]
[null,null,null,"Most\nRecent Year",null,"Previous Year",null,null,null,null,null,null,null,null,"Most\nRecent Year",null,"Previous Year"]
[null,null,"Financial year end date (DD/MM/YYYY)",null,null,null,null,null,null,null,null,null,null,"Financial year end date (DD/MM/YYYY)",null,42551]
[]
[null,null,"Gross Business Income",null,null,null,null,null,null,null,null,null,null,"Gross Business Income"]
[null,null," less expenses ",null,null,null,null,null,null,null,null,null,null," less expenses "]
[null,null," plus superannuation over 11%",null,null,null,null,null,null,null,null,null,null," plus superannuation over 11%"]
[]
[null,null,"plus depreciation",null,null,null,null,null,null,null,null,null,null,"plus depreciation"]
[null,null," plus interest / leasing charges",null,null,null,null,null,null,null,null,null,null," plus interest / leasing charges"]
[]
[null,null," less Ongoing Business Loan REPAYMENTS",null,null,null,null,null,null,null,null,null,null," less Ongoing Business Loan REPAYMENTS"]
[null,null,null,null,null,null,null,"Total Business Income",null,null,null,null,null,null,null,null,null,null,"Total Business Income"]
[null,null,"Director Wages:",null,null,null,null,"Most Recent Year","Previous Year",null,null,null,null,"Director Wages:",null,null,null,null,"Most Recent Year","Previous Year"]
[null,null,"Applicant 1",null,null,null,null,{"$f":"(D$10-D$11+D$12-D$17)*D28+D20","v":0},{"$f":"(F$10-F$11+F$12-D$17)*F28+F20","v":0},null,null,null,null,"Applicant 1",null,null,null,null,{"$f":"(O$10-O$11+O$12-O$17)*O28+O20","v":0},{"$f":"(Q$10-Q$11+Q$12-O$17)*Q28+Q20","v":0}]
[null,null,"Applicant 2",null,null,null,null,{"$f":"(D$10-D$11+D$12-D$17)*D29+D21","v":0},{"$f":"(F$10-F$11+F$12-D$17)*F29+F21","v":0},null,null,null,null,"Applicant 2",null,null,null,null,{"$f":"(O$10-O$11+O$12-O$17)*O29+O21","v":0},{"$f":"(Q$10-Q$11+Q$12-O$17)*Q29+Q21","v":0}]
[null,null,"Applicant 3",null,null,null,null,0,0,null,null,null,null,"Applicant 3",null,null,null,null,0,0]
[null,null,"Applicant 4",null,null,null,null,0,0,null,null,null,null,"Applicant 4",null,null,null,null,0,0]
[null,null,"Applicant 5",null,null,null,null,0,0,null,null,null,null,"Applicant 5",null,null,null,null,0,0]
[null,null,"Applicant 6",null,null,null,null,0,0,null,null,null,null,"Applicant 6",null,null,null,null,0,0]
[null,null,null,null,null,null,null,"Untaxed Addbacks",null,null,null,null,null,null,null,null,null,null,"Untaxed Addbacks"]
[null,null,"Applicant's Entitlement:",null,null,null,null,"Most Recent Year","Previous Year",null,null,null,null,"Applicant's Entitlement:",null,null,null,null,"Most Recent Year","Previous Year"]
[null,null,"Applicant 1",null,null,null,null,{"$f":"(D$15+D$14)*$D28","v":0},{"$f":"(F$15+F$14)*$F28","v":0},null,null,null,null,"Applicant 1",null,null,null,null,{"$f":"(O$15+O$14)*$O28","v":0},{"$f":"(Q$15+Q$14)*$Q28","v":0}]
[null,null,"Applicant 2",null,null,null,null,0,0,null,null,null,null,"Applicant 2",null,null,null,null,0,0]
[null,null,"Applicant 3",null,null,null,null,0,0,null,null,null,null,"Applicant 3",null,null,null,null,0,0]
[null,null,"Applicant 4",null,null,null,null,0,0,null,null,null,null,"Applicant 4",null,null,null,null,0,0]
[null,null,"Applicant 5",null,null,null,null,0,0,null,null,null,null,"Applicant 5",null,null,null,null,0,0]
[null,null,"Applicant 6",null,null,null,null,0,0,null,null,null,null,"Applicant 6",null,null,null,null,0,0]
[null,null,null,{"$f":"IF(SUM(D28:D33)>100%,\"Check: >100%\",\"\")","v":""},null,{"$f":"IF(SUM(F28:F33)>100%,\"Check\",\"\")","v":""},null,null,null,null,null,null,null,null,{"$f":"IF(SUM(O28:O33)>100%,\"Check: >100%\",\"\")","v":""},null,{"$f":"IF(SUM(Q28:Q33)>100%,\"Check\",\"\")","v":""}]
[null,null,"Calculations: Business 1",null,null,null,null,null,null,null,null,null,null,"Calculations: Business 2"]
[]
[null,null,null,"Self-Employed Income",null,null,null,null,null,null,null,null,null,null,"Self-Employed Income"]
[null,null,"Applicant 1",{"$f":"IF(H20>I20,AVERAGE(H20,I20),H20)","v":0},null,null,null,null,null,null,null,null,null,"Applicant 1",{"$f":"IF(S20>T20,AVERAGE(S20,T20),S20)","v":0}]
[null,null,"Applicant 2",0,null,null,null,null,null,null,null,null,null,"Applicant 2",0]
[null,null,"Applicant 3",0,null,null,null,null,null,null,null,null,null,"Applicant 3",0]
[null,null,"Applicant 4",0,null,null,null,null,null,null,null,null,null,"Applicant 4",0]
[null,null,"Applicant 5",0,null,null,null,null,null,null,null,null,null,"Applicant 5",0]
[null,null,"Applicant 6",0,null,null,null,null,null,null,null,null,null,"Applicant 6",0]
[]
[null,null,null,"Addbacks",null,null,null,null,null,null,null,null,null,null,"Addbacks"]
[null,null,"Applicant 1",{"$f":"IF(H28>I28,AVERAGE(H28,I28),H28)","v":0},null,null,null,null,null,null,null,null,null,"Applicant 1",{"$f":"IF(S28>T28,AVERAGE(S28,T28),S28)","v":0}]
[null,null,"Applicant 2",0,null,null,null,null,null,null,null,null,null,"Applicant 2",0]
[null,null,"Applicant 3",0,null,null,null,null,null,null,null,null,null,"Applicant 3",0]
[null,null,"Applicant 4",0,null,null,null,null,null,null,null,null,null,"Applicant 4",0]
[null,null,"Applicant 5",0,null,null,null,null,null,null,null,null,null,"Applicant 5",0]
[null,null,"Applicant 6",0,null,null,null,null,null,null,null,null,null,"Applicant 6",0]
[]
[]
[]
[]
[null,null,"Outputs"]
[]
[null,null,null,"Self-Employed Income"]
[null,null,"Applicant 1",{"$f":"D38+O38","v":0}]
[null,null,"Applicant 2",0]
[null,null,"Applicant 3",0]
[null,null,"Applicant 4",0]
[null,null,"Applicant 5",0]
[null,null,"Applicant 6",0]
[]
[null,null,null,"Addbacks"]
[null,null,"Applicant 1",{"$f":"D46+O46","v":0}]
[null,null,"Applicant 2",0]
[null,null,"Applicant 3",0]
[null,null,"Applicant 4",0]
[null,null,"Applicant 5",0]
[null,null,"Applicant 6",0]

{"sheet":"Validation","index":5,"n_rows":42,"n_cols":26,"rows_kept":42,"cut":false,"hidden":true,"merged":[]}
["Residential","Applicant 1","Applicant 2","Applicant 3","Applicant 4","Applicant 5","Applicant 6",null,"CRE","Applicant 1","Applicant 2","Applicant 3","Applicant 4",null,"CREBetterChoice","Applicant 1","Applicant 2","Applicant 3","Applicant 4",null,null,"Valid Status Resi",null,"Valid Status CRE",null,"Valid Status CREBC"]
["Applicant 1",{"$f":"IF(AND(B$1<>$A2,HLOOKUP($A2,Residential!$E$14:$O$15,2,FALSE)=\"Individual (Couple)\",Residential!E$15=\"Individual (Couple)\"),$A2)","v":false},{"$f":"IF(AND(C$1<>$A2,HLOOKUP($A2,Residential!$E$14:$O$15,2,FALSE)=\"Individual (Couple)\",Residential!G$15=\"Individual (Couple)\"),$A2)","v":false},{"$f":"IF(AND(D$1<>$A2,HLOOKUP($A2,Residential!$E$14:$O$15,2,FALSE)=\"Individual (Couple)\",Residential!I$15=\"Individual (Couple)\"),$A2)","v":false},{"$f":"IF(AND(E$1<>$A2,HLOOKUP($A2,Residential!$E$14:$O$15,2,FALSE)=\"Individual (Couple)\",Residential!K$15=\"Individual (Couple)\"),$A2)","v":false},{"$f":"IF(AND(F$1<>$A2,HLOOKUP($A2,Residential!$E$14:$O$15,2,FALSE)=\"Individual (Couple)\",Residential!M$15=\"Individual (Couple)\"),$A2)","v":false},{"$f":"IF(AND(G$1<>$A2,HLOOKUP($A2,Residential!$E$14:$O$15,2,FALSE)=\"Individual (Couple)\",Residential!O$15=\"Individual (Couple)\"),$A2)","v":false},null,"Applicant 1",{"$f":"IF(AND(J$1<>$I2,HLOOKUP($I2,Commercial!$E$38:$K$39,2,FALSE)=\"Individual (Couple)\",Commercial!E$39=\"Individual (Couple)\"),$I2)","v":false},{"$f":"IF(AND(K$1<>$I2,HLOOKUP($I2,Commercial!$E$38:$K$39,2,FALSE)=\"Individual (Couple)\",Commercial!G$39=\"Individual (Couple)\"),$I2)","v":false},{"$f":"IF(AND(L$1<>$I2,HLOOKUP($I2,Commercial!$E$38:$K$39,2,FALSE)=\"Individual (Couple)\",Commercial!I$39=\"Individual (Couple)\"),$I2)","v":false},{"$f":"IF(AND(M$1<>$I2,HLOOKUP($I2,Commercial!$E$38:$K$39,2,FALSE)=\"Individual (Couple)\",Commercial!K$39=\"Individual (Couple)\"),$I2)","v":false},null,"Applicant 1",{"$f":"IF(AND(P$1<>$O2,HLOOKUP($O2,#REF!,2,FALSE)=\"Individual (Couple)\",#REF!=\"Individual (Couple)\"),$O2)","v":{"$error":"#REF!"}},{"$f":"IF(AND(Q$1<>$O2,HLOOKUP($O2,#REF!,2,FALSE)=\"Individual (Couple)\",#REF!=\"Individual (Couple)\"),$O2)","v":{"$error":"#REF!"}},{"$f":"IF(AND(R$1<>$O2,HLOOKUP($O2,#REF!,2,FALSE)=\"Individual (Couple)\",#REF!=\"Individual (Couple)\"),$O2)","v":{"$error":"#REF!"}},{"$f":"IF(AND(S$1<>$O2,HLOOKUP($O2,#REF!,2,FALSE)=\"Individual (Couple)\",#REF!=\"Individual (Couple)\"),$O2)","v":{"$error":"#REF!"}},null,null,"Company",null,"Individual (Single)",null,"Individual (Single)"]
["Applicant 2",{"$f":"IF(AND(B$1<>$A3,HLOOKUP($A3,Residential!$E$14:$O$15,2,FALSE)=\"Individual (Couple)\",Residential!E$15=\"Individual (Couple)\"),$A3)","v":false},{"$f":"IF(AND(C$1<>$A3,HLOOKUP($A3,Residential!$E$14:$O$15,2,FALSE)=\"Individual (Couple)\",Residential!G$15=\"Individual (Couple)\"),$A3)","v":false},{"$f":"IF(AND(D$1<>$A3,HLOOKUP($A3,Residential!$E$14:$O$15,2,FALSE)=\"Individual (Couple)\",Residential!I$15=\"Individual (Couple)\"),$A3)","v":false},{"$f":"IF(AND(E$1<>$A3,HLOOKUP($A3,Residential!$E$14:$O$15,2,FALSE)=\"Individual (Couple)\",Residential!K$15=\"Individual (Couple)\"),$A3)","v":false},{"$f":"IF(AND(F$1<>$A3,HLOOKUP($A3,Residential!$E$14:$O$15,2,FALSE)=\"Individual (Couple)\",Residential!M$15=\"Individual (Couple)\"),$A3)","v":false},{"$f":"IF(AND(G$1<>$A3,HLOOKUP($A3,Residential!$E$14:$O$15,2,FALSE)=\"Individual (Couple)\",Residential!O$15=\"Individual (Couple)\"),$A3)","v":false},null,"Applicant 2",{"$f":"IF(AND(J$1<>$I3,HLOOKUP($I3,Commercial!$E$38:$K$39,2,FALSE)=\"Individual (Couple)\",Commercial!E$39=\"Individual (Couple)\"),$I3)","v":false},{"$f":"IF(AND(K$1<>$I3,HLOOKUP($I3,Commercial!$E$38:$K$39,2,FALSE)=\"Individual (Couple)\",Commercial!G$39=\"Individual (Couple)\"),$I3)","v":false},{"$f":"IF(AND(L$1<>$I3,HLOOKUP($I3,Commercial!$E$38:$K$39,2,FALSE)=\"Individual (Couple)\",Commercial!I$39=\"Individual (Couple)\"),$I3)","v":false},{"$f":"IF(AND(M$1<>$I3,HLOOKUP($I3,Commercial!$E$38:$K$39,2,FALSE)=\"Individual (Couple)\",Commercial!K$39=\"Individual (Couple)\"),$I3)","v":false},null,"Applicant 2",{"$f":"IF(AND(P$1<>$O3,HLOOKUP($O3,#REF!,2,FALSE)=\"Individual (Couple)\",#REF!=\"Individual (Couple)\"),$O3)","v":{"$error":"#REF!"}},{"$f":"IF(AND(Q$1<>$O3,HLOOKUP($O3,#REF!,2,FALSE)=\"Individual (Couple)\",#REF!=\"Individual (Couple)\"),$O3)","v":{"$error":"#REF!"}},{"$f":"IF(AND(R$1<>$O3,HLOOKUP($O3,#REF!,2,FALSE)=\"Individual (Couple)\",#REF!=\"Individual (Couple)\"),$O3)","v":{"$error":"#REF!"}},{"$f":"IF(AND(S$1<>$O3,HLOOKUP($O3,#REF!,2,FALSE)=\"Individual (Couple)\",#REF!=\"Individual (Couple)\"),$O3)","v":{"$error":"#REF!"}},null,null,"Individual (Single)",null,"Individual (Couple)",null,"Individual (Couple)"]
["Applicant 3",{"$f":"IF(AND(B$1<>$A4,HLOOKUP($A4,Residential!$E$14:$O$15,2,FALSE)=\"Individual (Couple)\",Residential!E$15=\"Individual (Couple)\"),$A4)","v":false},{"$f":"IF(AND(C$1<>$A4,HLOOKUP($A4,Residential!$E$14:$O$15,2,FALSE)=\"Individual (Couple)\",Residential!G$15=\"Individual (Couple)\"),$A4)","v":false},{"$f":"IF(AND(D$1<>$A4,HLOOKUP($A4,Residential!$E$14:$O$15,2,FALSE)=\"Individual (Couple)\",Residential!I$15=\"Individual (Couple)\"),$A4)","v":false},{"$f":"IF(AND(E$1<>$A4,HLOOKUP($A4,Residential!$E$14:$O$15,2,FALSE)=\"Individual (Couple)\",Residential!K$15=\"Individual (Couple)\"),$A4)","v":false},{"$f":"IF(AND(F$1<>$A4,HLOOKUP($A4,Residential!$E$14:$O$15,2,FALSE)=\"Individual (Couple)\",Residential!M$15=\"Individual (Couple)\"),$A4)","v":false},{"$f":"IF(AND(G$1<>$A4,HLOOKUP($A4,Residential!$E$14:$O$15,2,FALSE)=\"Individual (Couple)\",Residential!O$15=\"Individual (Couple)\"),$A4)","v":false},null,"Applicant 3",{"$f":"IF(AND(J$1<>$I4,HLOOKUP($I4,Commercial!$E$38:$K$39,2,FALSE)=\"Individual (Couple)\",Commercial!E$39=\"Individual (Couple)\"),$I4)","v":false},{"$f":"IF(AND(K$1<>$I4,HLOOKUP($I4,Commercial!$E$38:$K$39,2,FALSE)=\"Individual (Couple)\",Commercial!G$39=\"Individual (Couple)\"),$I4)","v":false},{"$f":"IF(AND(L$1<>$I4,HLOOKUP($I4,Commercial!$E$38:$K$39,2,FALSE)=\"Individual (Couple)\",Commercial!I$39=\"Individual (Couple)\"),$I4)","v":false},{"$f":"IF(AND(M$1<>$I4,HLOOKUP($I4,Commercial!$E$38:$K$39,2,FALSE)=\"Individual (Couple)\",Commercial!K$39=\"Individual (Couple)\"),$I4)","v":false},null,"Applicant 3",{"$f":"IF(AND(P$1<>$O4,HLOOKUP($O4,#REF!,2,FALSE)=\"Individual (Couple)\",#REF!=\"Individual (Couple)\"),$O4)","v":{"$error":"#REF!"}},{"$f":"IF(AND(Q$1<>$O4,HLOOKUP($O4,#REF!,2,FALSE)=\"Individual (Couple)\",#REF!=\"Individual (Couple)\"),$O4)","v":{"$error":"#REF!"}},{"$f":"IF(AND(R$1<>$O4,HLOOKUP($O4,#REF!,2,FALSE)=\"Individual (Couple)\",#REF!=\"Individual (Couple)\"),$O4)","v":{"$error":"#REF!"}},{"$f":"IF(AND(S$1<>$O4,HLOOKUP($O4,#REF!,2,FALSE)=\"Individual (Couple)\",#REF!=\"Individual (Couple)\"),$O4)","v":{"$error":"#REF!"}},null,null,"Individual (Couple)"]
["Applicant 4",{"$f":"IF(AND(B$1<>$A5,HLOOKUP($A5,Residential!$E$14:$O$15,2,FALSE)=\"Individual (Couple)\",Residential!E$15=\"Individual (Couple)\"),$A5)","v":false},{"$f":"IF(AND(C$1<>$A5,HLOOKUP($A5,Residential!$E$14:$O$15,2,FALSE)=\"Individual (Couple)\",Residential!G$15=\"Individual (Couple)\"),$A5)","v":false},{"$f":"IF(AND(D$1<>$A5,HLOOKUP($A5,Residential!$E$14:$O$15,2,FALSE)=\"Individual (Couple)\",Residential!I$15=\"Individual (Couple)\"),$A5)","v":false},{"$f":"IF(AND(E$1<>$A5,HLOOKUP($A5,Residential!$E$14:$O$15,2,FALSE)=\"Individual (Couple)\",Residential!K$15=\"Individual (Couple)\"),$A5)","v":false},{"$f":"IF(AND(F$1<>$A5,HLOOKUP($A5,Residential!$E$14:$O$15,2,FALSE)=\"Individual (Couple)\",Residential!M$15=\"Individual (Couple)\"),$A5)","v":false},{"$f":"IF(AND(G$1<>$A5,HLOOKUP($A5,Residential!$E$14:$O$15,2,FALSE)=\"Individual (Couple)\",Residential!O$15=\"Individual (Couple)\"),$A5)","v":false},null,"Applicant 4",{"$f":"IF(AND(J$1<>$I5,HLOOKUP($I5,Commercial!$E$38:$K$39,2,FALSE)=\"Individual (Couple)\",Commercial!E$39=\"Individual (Couple)\"),$I5)","v":false},{"$f":"IF(AND(K$1<>$I5,HLOOKUP($I5,Commercial!$E$38:$K$39,2,FALSE)=\"Individual (Couple)\",Commercial!G$39=\"Individual (Couple)\"),$I5)","v":false},{"$f":"IF(AND(L$1<>$I5,HLOOKUP($I5,Commercial!$E$38:$K$39,2,FALSE)=\"Individual (Couple)\",Commercial!I$39=\"Individual (Couple)\"),$I5)","v":false},{"$f":"IF(AND(M$1<>$I5,HLOOKUP($I5,Commercial!$E$38:$K$39,2,FALSE)=\"Individual (Couple)\",Commercial!K$39=\"Individual (Couple)\"),$I5)","v":false},null,"Applicant 4",{"$f":"IF(AND(P$1<>$O5,HLOOKUP($O5,#REF!,2,FALSE)=\"Individual (Couple)\",#REF!=\"Individual (Couple)\"),$O5)","v":{"$error":"#REF!"}},{"$f":"IF(AND(Q$1<>$O5,HLOOKUP($O5,#REF!,2,FALSE)=\"Individual (Couple)\",#REF!=\"Individual (Couple)\"),$O5)","v":{"$error":"#REF!"}},{"$f":"IF(AND(R$1<>$O5,HLOOKUP($O5,#REF!,2,FALSE)=\"Individual (Couple)\",#REF!=\"Individual (Couple)\"),$O5)","v":{"$error":"#REF!"}},{"$f":"IF(AND(S$1<>$O5,HLOOKUP($O5,#REF!,2,FALSE)=\"Individual (Couple)\",#REF!=\"Individual (Couple)\"),$O5)","v":{"$error":"#REF!"}}]
["Applicant 5",{"$f":"IF(AND(B$1<>$A6,HLOOKUP($A6,Residential!$E$14:$O$15,2,FALSE)=\"Individual (Couple)\",Residential!E$15=\"Individual (Couple)\"),$A6)","v":false},{"$f":"IF(AND(C$1<>$A6,HLOOKUP($A6,Residential!$E$14:$O$15,2,FALSE)=\"Individual (Couple)\",Residential!G$15=\"Individual (Couple)\"),$A6)","v":false},{"$f":"IF(AND(D$1<>$A6,HLOOKUP($A6,Residential!$E$14:$O$15,2,FALSE)=\"Individual (Couple)\",Residential!I$15=\"Individual (Couple)\"),$A6)","v":false},{"$f":"IF(AND(E$1<>$A6,HLOOKUP($A6,Residential!$E$14:$O$15,2,FALSE)=\"Individual (Couple)\",Residential!K$15=\"Individual (Couple)\"),$A6)","v":false},{"$f":"IF(AND(F$1<>$A6,HLOOKUP($A6,Residential!$E$14:$O$15,2,FALSE)=\"Individual (Couple)\",Residential!M$15=\"Individual (Couple)\"),$A6)","v":false},{"$f":"IF(AND(G$1<>$A6,HLOOKUP($A6,Residential!$E$14:$O$15,2,FALSE)=\"Individual (Couple)\",Residential!O$15=\"Individual (Couple)\"),$A6)","v":false}]
["Applicant 6",{"$f":"IF(AND(B$1<>$A7,HLOOKUP($A7,Residential!$E$14:$O$15,2,FALSE)=\"Individual (Couple)\",Residential!E$15=\"Individual (Couple)\"),$A7)","v":false},{"$f":"IF(AND(C$1<>$A7,HLOOKUP($A7,Residential!$E$14:$O$15,2,FALSE)=\"Individual (Couple)\",Residential!G$15=\"Individual (Couple)\"),$A7)","v":false},{"$f":"IF(AND(D$1<>$A7,HLOOKUP($A7,Residential!$E$14:$O$15,2,FALSE)=\"Individual (Couple)\",Residential!I$15=\"Individual (Couple)\"),$A7)","v":false},{"$f":"IF(AND(E$1<>$A7,HLOOKUP($A7,Residential!$E$14:$O$15,2,FALSE)=\"Individual (Couple)\",Residential!K$15=\"Individual (Couple)\"),$A7)","v":false},{"$f":"IF(AND(F$1<>$A7,HLOOKUP($A7,Residential!$E$14:$O$15,2,FALSE)=\"Individual (Couple)\",Residential!M$15=\"Individual (Couple)\"),$A7)","v":false},{"$f":"IF(AND(G$1<>$A7,HLOOKUP($A7,Residential!$E$14:$O$15,2,FALSE)=\"Individual (Couple)\",Residential!O$15=\"Individual (Couple)\"),$A7)","v":false}]
[]
[null,{"$f":"IF(MID(Residential!E15,13,6)<>\"Couple\",\"\",\"N/A\")","v":""},{"$f":"IF(MID(Residential!G15,13,6)<>\"Couple\",\"\",\"N/A\")","v":""},{"$f":"IF(MID(Residential!I15,13,6)<>\"Couple\",\"\",\"N/A\")","v":""},{"$f":"IF(MID(Residential!K15,13,6)<>\"Couple\",\"\",\"N/A\")","v":""},{"$f":"IF(MID(Residential!M15,13,6)<>\"Couple\",\"\",\"N/A\")","v":""},{"$f":"IF(MID(Residential!O15,13,6)<>\"Couple\",\"\",\"N/A\")","v":""},null,null,{"$f":"IF(MID(Commercial!$E39,13,6)<>\"Couple\",\"\",\"N/A\")","v":""},{"$f":"IF(MID(Commercial!$G39,13,6)<>\"Couple\",\"\",\"N/A\")","v":""},{"$f":"IF(MID(Commercial!$I39,13,6)<>\"Couple\",\"\",\"N/A\")","v":""},{"$f":"IF(MID(Commercial!$K39,13,6)<>\"Couple\",\"\",\"N/A\")","v":""},null,null,{"$f":"IF(MID(#REF!,13,6)<>\"Couple\",\"\",\"N/A\")","v":{"$error":"#REF!"}},{"$f":"IF(MID(#REF!,13,6)<>\"Couple\",\"\",\"N/A\")","v":{"$error":"#REF!"}},{"$f":"IF(MID(#REF!,13,6)<>\"Couple\",\"\",\"N/A\")","v":{"$error":"#REF!"}},{"$f":"IF(MID(#REF!,13,6)<>\"Couple\",\"\",\"N/A\")","v":{"$error":"#REF!"}}]
[null,{"$f":"IF(MID(Residential!E15,13,6)<>\"Couple\",\"\",\"Non-loan party\")","v":""},{"$f":"IF(MID(Residential!G15,13,6)<>\"Couple\",\"\",\"Non-loan party\")","v":""},{"$f":"IF(MID(Residential!I15,13,6)<>\"Couple\",\"\",\"Non-loan party\")","v":""},{"$f":"IF(MID(Residential!K15,13,6)<>\"Couple\",\"\",\"Non-loan party\")","v":""},{"$f":"IF(MID(Residential!M15,13,6)<>\"Couple\",\"\",\"Non-loan party\")","v":""},{"$f":"IF(MID(Residential!O15,13,6)<>\"Couple\",\"\",\"Non-loan party\")","v":""},null,null,{"$f":"IF(MID(Commercial!$E39,13,6)<>\"Couple\",\"\",\"Non-loan party\")","v":""},{"$f":"IF(MID(Commercial!$G39,13,6)<>\"Couple\",\"\",\"Non-loan party\")","v":""},{"$f":"IF(MID(Commercial!$I39,13,6)<>\"Couple\",\"\",\"Non-loan party\")","v":""},{"$f":"IF(MID(Commercial!$K39,13,6)<>\"Couple\",\"\",\"Non-loan party\")","v":""},null,null,{"$f":"IF(MID(#REF!,13,6)<>\"Couple\",\"\",\"Non-loan party\")","v":{"$error":"#REF!"}},{"$f":"IF(MID(#REF!,13,6)<>\"Couple\",\"\",\"Non-loan party\")","v":{"$error":"#REF!"}},{"$f":"IF(MID(#REF!,13,6)<>\"Couple\",\"\",\"Non-loan party\")","v":{"$error":"#REF!"}},{"$f":"IF(MID(#REF!,13,6)<>\"Couple\",\"\",\"Non-loan party\")","v":{"$error":"#REF!"}}]
[null,{"$f":"IFERROR(INDEX(B$2:B$7,SMALL(IF(ISTEXT(B$2:B$7),ROW(B$1:B$6),\"\"), ROW(B2)-1)),\"-\")","v":"-"},{"$f":"IFERROR(INDEX(C$2:C$7,SMALL(IF(ISTEXT(C$2:C$7),ROW(C$1:C$6),\"\"), ROW(C2)-1)),\"-\")","v":"-"},{"$f":"IFERROR(INDEX(D$2:D$7,SMALL(IF(ISTEXT(D$2:D$7),ROW(D$1:D$6),\"\"), ROW(D2)-1)),\"-\")","v":"-"},{"$f":"IFERROR(INDEX(E$2:E$7,SMALL(IF(ISTEXT(E$2:E$7),ROW(E$1:E$6),\"\"), ROW(E2)-1)),\"-\")","v":"-"},{"$f":"IFERROR(INDEX(F$2:F$7,SMALL(IF(ISTEXT(F$2:F$7),ROW(F$1:F$6),\"\"), ROW(F2)-1)),\"-\")","v":"-"},{"$f":"IFERROR(INDEX(G$2:G$7,SMALL(IF(ISTEXT(G$2:G$7),ROW(G$1:G$6),\"\"), ROW(G2)-1)),\"-\")","v":"-"},null,null,{"$f":"IFERROR(INDEX(J$2:J$5,SMALL(IF(ISTEXT(J$2:J$5),ROW(J$1:J$4),\"\"), ROW(J2)-1)),\"-\")","v":"-"},{"$f":"IFERROR(INDEX(K$2:K$5,SMALL(IF(ISTEXT(K$2:K$5),ROW(K$1:K$4),\"\"), ROW(K2)-1)),\"-\")","v":"-"},{"$f":"IFERROR(INDEX(L$2:L$5,SMALL(IF(ISTEXT(L$2:L$5),ROW(L$1:L$4),\"\"), ROW(L2)-1)),\"-\")","v":"-"},{"$f":"IFERROR(INDEX(M$2:M$5,SMALL(IF(ISTEXT(M$2:M$5),ROW(M$1:M$4),\"\"), ROW(M2)-1)),\"-\")","v":"-"},null,null,{"$f":"IFERROR(INDEX(P$2:P$5,SMALL(IF(ISTEXT(P$2:P$5),ROW(P$1:P$4),\"\"), ROW(P2)-1)),\"-\")","v":"-"},{"$f":"IFERROR(INDEX(Q$2:Q$5,SMALL(IF(ISTEXT(Q$2:Q$5),ROW(Q$1:Q$4),\"\"), ROW(Q2)-1)),\"-\")","v":"-"},{"$f":"IFERROR(INDEX(R$2:R$5,SMALL(IF(ISTEXT(R$2:R$5),ROW(R$1:R$4),\"\"), ROW(R2)-1)),\"-\")","v":"-"},{"$f":"IFERROR(INDEX(S$2:S$5,SMALL(IF(ISTEXT(S$2:S$5),ROW(S$1:S$4),\"\"), ROW(S2)-1)),\"-\")","v":"-"}]
[null,{"$f":"IFERROR(INDEX(B$2:B$7,SMALL(IF(ISTEXT(B$2:B$7),ROW(B$1:B$6),\"\"), ROW(B3)-1)),\"-\")","v":"-"},{"$f":"IFERROR(INDEX(C$2:C$7,SMALL(IF(ISTEXT(C$2:C$7),ROW(C$1:C$6),\"\"), ROW(C3)-1)),\"-\")","v":"-"},{"$f":"IFERROR(INDEX(D$2:D$7,SMALL(IF(ISTEXT(D$2:D$7),ROW(D$1:D$6),\"\"), ROW(D3)-1)),\"-\")","v":"-"},{"$f":"IFERROR(INDEX(E$2:E$7,SMALL(IF(ISTEXT(E$2:E$7),ROW(E$1:E$6),\"\"), ROW(E3)-1)),\"-\")","v":"-"},{"$f":"IFERROR(INDEX(F$2:F$7,SMALL(IF(ISTEXT(F$2:F$7),ROW(F$1:F$6),\"\"), ROW(F3)-1)),\"-\")","v":"-"},{"$f":"IFERROR(INDEX(G$2:G$7,SMALL(IF(ISTEXT(G$2:G$7),ROW(G$1:G$6),\"\"), ROW(G3)-1)),\"-\")","v":"-"},null,null,{"$f":"IFERROR(INDEX(J$2:J$5,SMALL(IF(ISTEXT(J$2:J$5),ROW(J$1:J$4),\"\"), ROW(J3)-1)),\"-\")","v":"-"},{"$f":"IFERROR(INDEX(K$2:K$5,SMALL(IF(ISTEXT(K$2:K$5),ROW(K$1:K$4),\"\"), ROW(K3)-1)),\"-\")","v":"-"},{"$f":"IFERROR(INDEX(L$2:L$5,SMALL(IF(ISTEXT(L$2:L$5),ROW(L$1:L$4),\"\"), ROW(L3)-1)),\"-\")","v":"-"},{"$f":"IFERROR(INDEX(M$2:M$5,SMALL(IF(ISTEXT(M$2:M$5),ROW(M$1:M$4),\"\"), ROW(M3)-1)),\"-\")","v":"-"},null,null,{"$f":"IFERROR(INDEX(P$2:P$5,SMALL(IF(ISTEXT(P$2:P$5),ROW(P$1:P$4),\"\"), ROW(P3)-1)),\"-\")","v":"-"},{"$f":"IFERROR(INDEX(Q$2:Q$5,SMALL(IF(ISTEXT(Q$2:Q$5),ROW(Q$1:Q$4),\"\"), ROW(Q3)-1)),\"-\")","v":"-"},{"$f":"IFERROR(INDEX(R$2:R$5,SMALL(IF(ISTEXT(R$2:R$5),ROW(R$1:R$4),\"\"), ROW(R3)-1)),\"-\")","v":"-"},{"$f":"IFERROR(INDEX(S$2:S$5,SMALL(IF(ISTEXT(S$2:S$5),ROW(S$1:S$4),\"\"), ROW(S3)-1)),\"-\")","v":"-"}]
[null,{"$f":"IFERROR(INDEX(B$2:B$7,SMALL(IF(ISTEXT(B$2:B$7),ROW(B$1:B$6),\"\"), ROW(B4)-1)),\"-\")","v":"-"},{"$f":"IFERROR(INDEX(C$2:C$7,SMALL(IF(ISTEXT(C$2:C$7),ROW(C$1:C$6),\"\"), ROW(C4)-1)),\"-\")","v":"-"},{"$f":"IFERROR(INDEX(D$2:D$7,SMALL(IF(ISTEXT(D$2:D$7),ROW(D$1:D$6),\"\"), ROW(D4)-1)),\"-\")","v":"-"},{"$f":"IFERROR(INDEX(E$2:E$7,SMALL(IF(ISTEXT(E$2:E$7),ROW(E$1:E$6),\"\"), ROW(E4)-1)),\"-\")","v":"-"},{"$f":"IFERROR(INDEX(F$2:F$7,SMALL(IF(ISTEXT(F$2:F$7),ROW(F$1:F$6),\"\"), ROW(F4)-1)),\"-\")","v":"-"},{"$f":"IFERROR(INDEX(G$2:G$7,SMALL(IF(ISTEXT(G$2:G$7),ROW(G$1:G$6),\"\"), ROW(G4)-1)),\"-\")","v":"-"},null,null,{"$f":"IFERROR(INDEX(J$2:J$5,SMALL(IF(ISTEXT(J$2:J$5),ROW(J$1:J$4),\"\"), ROW(J4)-1)),\"-\")","v":"-"},{"$f":"IFERROR(INDEX(K$2:K$5,SMALL(IF(ISTEXT(K$2:K$5),ROW(K$1:K$4),\"\"), ROW(K4)-1)),\"-\")","v":"-"},{"$f":"IFERROR(INDEX(L$2:L$5,SMALL(IF(ISTEXT(L$2:L$5),ROW(L$1:L$4),\"\"), ROW(L4)-1)),\"-\")","v":"-"},{"$f":"IFERROR(INDEX(M$2:M$5,SMALL(IF(ISTEXT(M$2:M$5),ROW(M$1:M$4),\"\"), ROW(M4)-1)),\"-\")","v":"-"},null,null,{"$f":"IFERROR(INDEX(P$2:P$5,SMALL(IF(ISTEXT(P$2:P$5),ROW(P$1:P$4),\"\"), ROW(P4)-1)),\"-\")","v":"-"},{"$f":"IFERROR(INDEX(Q$2:Q$5,SMALL(IF(ISTEXT(Q$2:Q$5),ROW(Q$1:Q$4),\"\"), ROW(Q4)-1)),\"-\")","v":"-"},{"$f":"IFERROR(INDEX(R$2:R$5,SMALL(IF(ISTEXT(R$2:R$5),ROW(R$1:R$4),\"\"), ROW(R4)-1)),\"-\")","v":"-"},{"$f":"IFERROR(INDEX(S$2:S$5,SMALL(IF(ISTEXT(S$2:S$5),ROW(S$1:S$4),\"\"), ROW(S4)-1)),\"-\")","v":"-"}]
[null,{"$f":"IFERROR(INDEX(B$2:B$7,SMALL(IF(ISTEXT(B$2:B$7),ROW(B$1:B$6),\"\"), ROW(B5)-1)),\"-\")","v":"-"},{"$f":"IFERROR(INDEX(C$2:C$7,SMALL(IF(ISTEXT(C$2:C$7),ROW(C$1:C$6),\"\"), ROW(C5)-1)),\"-\")","v":"-"},{"$f":"IFERROR(INDEX(D$2:D$7,SMALL(IF(ISTEXT(D$2:D$7),ROW(D$1:D$6),\"\"), ROW(D5)-1)),\"-\")","v":"-"},{"$f":"IFERROR(INDEX(E$2:E$7,SMALL(IF(ISTEXT(E$2:E$7),ROW(E$1:E$6),\"\"), ROW(E5)-1)),\"-\")","v":"-"},{"$f":"IFERROR(INDEX(F$2:F$7,SMALL(IF(ISTEXT(F$2:F$7),ROW(F$1:F$6),\"\"), ROW(F5)-1)),\"-\")","v":"-"},{"$f":"IFERROR(INDEX(G$2:G$7,SMALL(IF(ISTEXT(G$2:G$7),ROW(G$1:G$6),\"\"), ROW(G5)-1)),\"-\")","v":"-"}]
[null,{"$f":"IFERROR(INDEX(B$2:B$7,SMALL(IF(ISTEXT(B$2:B$7),ROW(B$1:B$6),\"\"), ROW(B6)-1)),\"-\")","v":"-"},{"$f":"IFERROR(INDEX(C$2:C$7,SMALL(IF(ISTEXT(C$2:C$7),ROW(C$1:C$6),\"\"), ROW(C6)-1)),\"-\")","v":"-"},{"$f":"IFERROR(INDEX(D$2:D$7,SMALL(IF(ISTEXT(D$2:D$7),ROW(D$1:D$6),\"\"), ROW(D6)-1)),\"-\")","v":"-"},{"$f":"IFERROR(INDEX(E$2:E$7,SMALL(IF(ISTEXT(E$2:E$7),ROW(E$1:E$6),\"\"), ROW(E6)-1)),\"-\")","v":"-"},{"$f":"IFERROR(INDEX(F$2:F$7,SMALL(IF(ISTEXT(F$2:F$7),ROW(F$1:F$6),\"\"), ROW(F6)-1)),\"-\")","v":"-"},{"$f":"IFERROR(INDEX(G$2:G$7,SMALL(IF(ISTEXT(G$2:G$7),ROW(G$1:G$6),\"\"), ROW(G6)-1)),\"-\")","v":"-"}]
[]
[]
[]
["Dependents Lookup"]
["Dependents","DependedntsCode"]
[0,1]
[1,1]
[2,2]
[3,3]
[4,"4+"]
[]
[]
[]
[]
[]
[]
[]
[]
[]
[]
[]
[null,"Don’t remove","Don’t remove"]
[]
["Servicability Calculator",null,null,null,null,null,null,null,"CRE",null,null,null,null,null,"CREBetterChoice"]
[null,"Applicant 1","Applicant 2","Applicant 3","Applicant 4","Applicant 5","Applicant 6",null,"Applicant 1","Applicant 2","Applicant 3","Applicant 4",null,null,"Applicant 1","Applicant 2","Applicant 3","Applicant 4"]
["Status",null,null,null,null,null,null,null,null,null,null,null,null,null,null,null,0,0]
["Individual (Couple) With",null,null,null,null,null,null,null,null,null,null,null,null,null,null,null,0,0]

{"sheet":"Tax Table","index":6,"n_rows":25,"n_cols":9,"rows_kept":25,"cut":false,"hidden":true,"merged":[[3,0,3,2],[8,0,8,2],[3,4,3,5],[17,0,17,2]]}
[]
[null,null,null,null,null,null,null,null,"This is the Tax Offset for Low income earners"]
[null,null,null,null,null,null,null,null,"https://www.ato.gov.au/individuals/income-deductions-offsets-and-records/tax-offsets/low-and-middle-income-earner-tax-offsets/"]
["Medicare Levy 2021 - 2022",null,null,1,"Tax offset for Low income earners",null,"Tax Offset reduced %"]
["Threshold","Value","Rate",null,"Thresholds","Max Tax Offset"]
["Minimum for partial levy",23365,0.1,null,0,700]
["Minimum for full levy",29207,0.02,null,37500,700,-0.05]
[null,null,null,null,45000,325,-1.4999999999999999E-2]
["Tax 2021-2022",null,null,null,66667,0]
["Tax Bracket Min","Tax For Bracket","Tax Rate",null,999999999]
[0,0,0]
[18200,0,0.19]
[45000,{"$f":"(A13-A12)*C12","v":5092},0.32500000000000001]
[120000,{"$f":"(A13-A12)*C12+(A14-A13)*C13","v":29467},0.37]
[180000,{"$f":"(A13-A12)*C12+(A14-A13)*C13+(A15-A14)*C14","v":51667},0.45]
[999999999,{"$f":"B15","v":51667},0.45]
[]
["Tax 2022-2023"]
["Tax Bracket Min","Tax For Bracket","Tax Rate",null,null,null,null,null,"This is the  Medicare levy reduction for low income earners"]
[0,0,0,null,null,null,null,null,"https://www.ato.gov.au/Individuals/Medicare-and-private-health-insurance/Medicare-levy/Medicare-levy-reduction/Medicare-levy-reduction-for-low-income-earners/"]
[18200,0,0.19]
[45000,{"$f":"(A22-A21)*C21","v":5092},0.32500000000000001]
[120000,{"$f":"(A22-A21)*C21+(A23-A22)*C22","v":29467},0.37]
[180000,{"$f":"(A22-A21)*C21+(A23-A22)*C22+(A24-A23)*C23","v":51667},0.45]
[999999999,{"$f":"B24","v":51667},0.45]

{"sheet":"Inputs","index":7,"n_rows":46,"n_cols":15,"rows_kept":46,"cut":false,"hidden":true,"merged":[]}
["Inputs",null,null,null,null,null,null,null,null,null,"Hem Classification"]
[null,null,null,null,null,null,null,null,null,null,"Category","Compared to HEM",null,null,"Note: Please make changes in \"Residential\" Worksheet column K and L"]
["Baseline Assessment Rate",5.5E-2,null,null,null,null,null,"Owner occupied property utilities, rates & costs",null,null,{"$f":"Residential!C50","v":"Primary residence utilities, rates & expenses"},{"$f":"Residential!F50","v":"Yes"}]
[null,null,null,null,null,null,null,"Rented property costs",null,null,{"$f":"Residential!C51","v":"Primary residence strata fees & land tax & FHB property tax"},{"$f":"Residential!F51","v":"No"}]
["Assessment Loading",{"$f":"IF(Residential!K8=\"1.00% (eligibility below)\", 1%,2%)","v":0.02},null,null,null,null,null,"Investment property utilities, rates & costs",null,null,{"$f":"Residential!C52","v":"Investment property utilities, rates, strata fees & land tax"},{"$f":"Residential!F52","v":"No"}]
[null,null,null,null,null,null,null,"Telephone, Internet, Pay TV & Media Streaming",null,null,{"$f":"Residential!C53","v":"Telephone, internet, Pay TV & media streaming"},{"$f":"Residential!F53","v":"Yes"}]
["Credit Card Commitments",3.8199999999999998E-2,null,null,null,null,null,"Groceries",null,null,{"$f":"Residential!C54","v":"Groceries"},{"$f":"Residential!F54","v":"Yes"}]
[null,null,null,null,null,null,null,"Recreation & Entertainment",null,null,{"$f":"Residential!C55","v":"Recreation & Entertainment"},{"$f":"Residential!F55","v":"Yes"}]
["Workings for Negative Gearing",6.0400000000000002E-2,null,null,null,null,null,"Clothing & Personal Care",null,null,{"$f":"Residential!C56","v":"Clothing & Personal Care"},{"$f":"Residential!F56","v":"Yes"}]
[null,null,null,null,null,null,null,"Medical & Health",null,null,{"$f":"Residential!C57","v":"Medical & Health"},{"$f":"Residential!F57","v":"Yes"}]
["Other Mortgage Repayment Buffer",1.25,null,null,null,null,null,"Transport",null,null,{"$f":"Residential!C58","v":"Transport"},{"$f":"Residential!F58","v":"Yes"}]
[null,null,null,null,null,null,null,"Education",null,null,{"$f":"Residential!C59","v":"Education – non Private schooling"},{"$f":"Residential!F59","v":"Yes"}]
["Rental Income Shading",0.8,null,null,null,null,null,null,null,null,{"$f":"Residential!C60","v":"Education - Private schooling "},{"$f":"Residential!F60","v":"No"}]
[null,null,null,null,null,null,null,"Childcare",null,null,{"$f":"Residential!C61","v":"Childcare"},{"$f":"Residential!F61","v":"Yes"}]
["Company Tax",0.25,null,null,null,null,null,"Insurance",null,null,{"$f":"Residential!C62","v":"Insurance - General Basic"},{"$f":"Residential!F62","v":"Yes"}]
[null,null,null,null,null,null,null,null,null,null,{"$f":"Residential!C63","v":"Insurance - Health, Sickness, Personal Accident & Life "},{"$f":"Residential!F63","v":"No"}]
["NumberOfWeeksInAYear",52,null,null,null,null,null,"Other Living Expenses",null,null,{"$f":"Residential!C64","v":"Other Living Expenses"},{"$f":"Residential!F64","v":"No"}]
["NumberOfMonthsInAYear",12,null,null,null,null,null,null,null,null,{"$f":"Residential!C65","v":"Child & Spousal Maintenance "},{"$f":"Residential!F65","v":"No"}]
[]
["Acceptable NSR For LVR > 90%",1.35]
["Acceptable NSR For Applicants with majority income as Government Allowances",1.25]
["Acceptable NSR for All other applicants",1]
[]
["Allowable Government Allowance over Total Income Limitation",0.5]
[]
[]
[]
[null,null,null,null,null,null,null,"List for 1% buffer"]
[]
[null,null,null,null,null,null,null,0.02]
[null,null,null,null,null,null,null,"1.00% (eligibility below)"]
["CRE"]
[null,"Full Doc","Alt Doc","Lease Doc"]
["Minimum ICR",0,0,0]
["Minimum DSCR",0.995,1.1950000000000001,0.995]
["Minimum DSCR Better Choice",1.4950000000000001,1.4950000000000001,1.4950000000000001]
["Minimum DSCR Better Choice with condition message",1.2450000000000001,1.2450000000000001,1.2450000000000001,null,"Refer BDM"]
[]
[]
["Residenital"]
["Minimum Loan Term in Years",10]
["Maximum Loan Term In years",40]
["Maximum Loan Term In Years For Prime Loans",30]
[]
["Minimum Interest Only Loan term in Years",0]
["Maximum Interest Only Loan term in Years",5]

{"sheet":"Data","index":8,"n_rows":2,"n_cols":172,"rows_kept":2,"cut":false,"hidden":true,"merged":[]}
["Total Loan Amount","WAVG Interest Rate","WAVG Assessment Rate","Max Loan Term","Max IO Term","Loan Amount 1","Interest Rate 1","Assessement Rate 1","Loan Term 1","IO Term 1","Loan Amount 2","Interest Rate 2","Assessment Rate 2","Loan Term 2","IO Term 2","Status 1","Status 2","Status 3","Status 4","Status 5","Status 6","Couple With 1","Couple With 2","Couple With 3","Couple With 4","Couple With 5","Couple With 6","Dependants 1","Dependants 2","Dependants 3","Dependants 4","Dependants 5","Dependants 6","Gross Annual Income 1","Gross Annual Income 2","Gross Annual Income 3","Gross Annual Income 4","Gross Annual Income 5","Gross Annual Income 6","Untaxed Income 1","Untaxed Income 2","Untaxed Income 3","Untaxed Income 4","Untaxed Income 5","Untaxed Income 6","SEIC 1","SEIC 2","SEIC 3","SEIC 4","SEIC 5","SEIC 6","Add Backs 1","Add Backs 2","Add Backs 3","Add Backs 4","Add Backs 5","Add Backs 6","NPBT 1","NPBT 2","NPBT 3","NPBT 4","NPBT 5","NPBT 6","Gross Rental Income 1","Gross Rental Income 2","Gross Rental Income 3","Gross Rental Income 4","Gross Rental Income 5","Gross Rental Income 6","Investment Property Loan Balance 1","Investment Property Loan Balance 2","Investment Property Loan Balance 3","Investment Property Loan Balance 4","Investment Property Loan Balance 5","Investment Property Loan Balance 6","Primary residence utilities, rates & expenses","Primary residence strata fees & land tax","Investment property utilities, rates, strata fees & land tax","Telephone, internet, Pay TV & media streaming","Groceries","Recreation & Entertainment","Clothing & Personal Care","Medical & Health","Transport","Education – non Private schooling","Education - Private schooling ","Childcare","Insurance - General Basic","Insurance - Health, Sickness, Personal Accident & Life","Other Living Expenses","Child & Spousal Maintenance ","Compared To Hem - Primary residence costs including utilities, rates & expenses","Compared To Hem - Body Corporate Fees, Strata Fees, Land Tax on Owner Occupied property","Compared To Hem - Investment property costs including utilities, rates & strata fees & land tax","Compared To Hem - Telephone, internet, Pay TV & media streaming","Compared To Hem - Groceries","Compared To Hem - Recreation & Entertainment","Compared To Hem - Clothing & Personal Care","Compared To Hem - Medical & Health","Compared To Hem - Transport","Compared To Hem - Education – non Private schooling","Compared To Hem - Education - Private schooling ","Compared To Hem - Childcare","Compared To Hem - Insurance - General Basic","Compared To Hem - Insurance - Health, Sickness and Personal Accident, Life ","Compared To Hem - Other Living Expenses","Compared To Hem - Child and Spousal Maintenance ","Rent/Board","Total Credit Card Limit","Other Mortgage Repayments","Other Liabilities","Tax Applicant 1","Tax Applicant 2","Tax Applicant 3","Tax Applicant 4","Tax Applicant 5","Tax Applicant 6","Net Income Applicant 1","Net Income Applicant 2","Net Income Applicant 3","Net Income Applicant 4","Net Income Applicant 5","Net Income Applicant 6","Net Income Total","Hem Living Expense Applicant 1","Hem Living Expense Applicant 2","Hem Living Expense Applicant 3","Hem Living Expense Applicant 4","Hem Living Expense Applicant 5","Hem Living Expense Applicant 6","Hem Living Expense Total","Customer Nominated Living Expenses","Living Expense Used","Net Available Income","Baseline Assessment Rate","Assessment Loading","Credit Card Commitments","Workings for Negative Gearing","Other Mortgage Repayment Buffer","Rental Income Shading","Company Tax","Actual Rate Monthly Total Income","Actual Rate Monthly - Net Income","Actual Rate Monthly - Living Costs","Actual Rate Monthly - Net Available Income","Actual Rate Monthly - Proposed Repayments","Actual Rate Monthly - Other Commitments","Actual Rate Annually Total Income","Actual Rate Annually - Net Income","Actual Rate Annually - Living Costs","Actual Rate Annually - Net Available Income","Actual Rate Annually - Proposed Repayments","Actual Rate Annually - Other Commitments","Assessment Rate Monthly Total Income","Assessment Rate Monthly - Net Income","Assessment Rate Monthly - Living Costs","Assessment Rate Monthly - Net Available Income","Assessment Rate Monthly - Proposed Repayments","Assessment Rate Monthly - Other Commitments","Assessment Rate Annually Total Income","Assessment Rate Annually - Net Income","Assessment Rate Annually - Living Costs","Assessment Rate Annually - Net Available Income","Assessment Rate Annually - Proposed Repayments","Assessment Rate Annually - Other Commitments","Actual NSR","Actual DSR","Actual Results","Assessment NSR","Assessment DSR","Assessment Results","Eligible Loan Amount"]
[{"$f":"ResiNewLoanTotalAmount","v":0},{"$f":"ResiWAVGInterestRate","v":0},{"$f":"ResiWAVGAssessmentRate","v":5.5E-2},{"$f":"ResiWAVGLoanTerm","v":0},{"$f":"Residential!P12","v":0},{"$f":"ResiNewLoanAmount1","v":0},{"$f":"ResiInterestRate1","v":0},{"$f":"MAX(BaselineAssessmentRate,ResiInterestRate1+AssessmentLoading)","v":5.5E-2},{"$f":"ResiLoanTerm1","v":0},{"$f":"ResiLoanIOTerm1","v":0},{"$f":"ResiNewLoanAmount2","v":0},null,{"$f":"MAX(BaselineAssessmentRate,ResiInterestRate2+AssessmentLoading)","v":5.5E-2},{"$f":"ResiLoanTerm2","v":0},{"$f":"ResiLoanIOTerm2","v":0},{"$f":"IF(Residential!$E$15=\"\",\"\",Residential!$E$15)","v":""},{"$f":"IF(Residential!$G$15=\"\",\"\",Residential!$G$15)","v":""},{"$f":"IF(Residential!$I$15=\"\",\"\",Residential!$I$15)","v":""},{"$f":"IF(Residential!$K$15=\"\",\"\",Residential!$K$15)","v":""},{"$f":"IF(Residential!$M$15=\"\",\"\",Residential!$M$15)","v":""},{"$f":"IF(Residential!$O$15=\"\",\"\",Residential!$O$15)","v":""},{"$f":"IF(Residential!$E$16=\"\",\"\",Residential!$E$16)","v":""},{"$f":"IF(Residential!$G$16=\"\",\"\",Residential!$G$16)","v":""},{"$f":"IF(Residential!$I$16=\"\",\"\",Residential!$I$16)","v":""},{"$f":"IF(Residential!$K$16=\"\",\"\",Residential!$K$16)","v":""},{"$f":"IF(Residential!$M$16=\"\",\"\",Residential!$M$16)","v":""},{"$f":"IF(Residential!$O$16=\"\",\"\",Residential!$O$16)","v":""},{"$f":"IF(Residential!$E$17=\"\",\"\",Residential!$E$17)","v":""},{"$f":"IF(Residential!$G$17=\"\",\"\",Residential!$G$17)","v":""},{"$f":"IF(Residential!$I$17=\"\",\"\",Residential!$I$17)","v":""},{"$f":"IF(Residential!$K$17=\"\",\"\",Residential!$K$17)","v":""},{"$f":"IF(Residential!$M$17=\"\",\"\",Residential!$M$17)","v":""},{"$f":"IF(Residential!$O$17=\"\",\"\",Residential!$O$17)","v":""},{"$f":"Residential!$E$19","v":0},{"$f":"Residential!$G$19","v":0},{"$f":"Residential!$I$19","v":0},{"$f":"Residential!$K$19","v":0},{"$f":"Residential!$M$19","v":0},{"$f":"Residential!$O$19","v":0},{"$f":"Residential!$E$20","v":0},{"$f":"Residential!$G$20","v":0},{"$f":"Residential!$I$20","v":0},{"$f":"Residential!$K$20","v":0},{"$f":"Residential!$M$20","v":0},{"$f":"Residential!$O$20","v":0},{"$f":"Residential!$E$21","v":0},{"$f":"Residential!$G$21","v":0},{"$f":"Residential!$I$21","v":0},{"$f":"Residential!$K$21","v":0},{"$f":"Residential!$M$21","v":0},{"$f":"Residential!$O$21","v":0},{"$f":"Residential!$E$22","v":0},{"$f":"Residential!$G$22","v":0},{"$f":"Residential!$I$22","v":0},{"$f":"Residential!$K$22","v":0},{"$f":"Residential!$M$22","v":0},{"$f":"Residential!$O$22","v":0},{"$f":"Residential!$E$23","v":0},{"$f":"Residential!$G$23","v":0},{"$f":"Residential!$I$23","v":0},{"$f":"Residential!$K$23","v":0},{"$f":"Residential!$M$23","v":0},{"$f":"Residential!$O$23","v":0},{"$f":"Residential!$E$25","v":0},{"$f":"Residential!$G$25","v":0},{"$f":"Residential!$I$25","v":0},{"$f":"Residential!$K$25","v":0},{"$f":"Residential!$M$25","v":0},{"$f":"Residential!$O$25","v":0},{"$f":"Residential!$E$26","v":0},{"$f":"Residential!$G$26","v":0},{"$f":"Residential!$I$26","v":0},{"$f":"Residential!$K$26","v":0},{"$f":"Residential!$M$26","v":0},{"$f":"Residential!$O$26","v":0},{"$f":"Residential!$G$50","v":0},{"$f":"Residential!$G$51","v":0},{"$f":"Residential!$G$52","v":0},{"$f":"Residential!$G$53","v":0},{"$f":"Residential!$G$54","v":0},{"$f":"Residential!$G$55","v":0},{"$f":"Residential!$G$56","v":0},{"$f":"Residential!$G$57","v":0},{"$f":"Residential!$G$58","v":0},{"$f":"Residential!$G$59","v":0},{"$f":"Residential!$G$60","v":0},{"$f":"Residential!$G$61","v":0},{"$f":"Residential!$G$62","v":0},{"$f":"Residential!$G$63","v":0},{"$f":"Residential!$G$64","v":0},{"$f":"Residential!$G$65","v":0},{"$f":"Residential!$F$50","v":"Yes"},{"$f":"Residential!$F$51","v":"No"},{"$f":"Residential!$F$52","v":"No"},{"$f":"Residential!$F$53","v":"Yes"},{"$f":"Residential!$F$54","v":"Yes"},{"$f":"Residential!$F$55","v":"Yes"},{"$f":"Residential!$F$56","v":"Yes"},{"$f":"Residential!$F$57","v":"Yes"},{"$f":"Residential!$F$58","v":"Yes"},{"$f":"Residential!$F$59","v":"Yes"},{"$f":"Residential!$F$60","v":"No"},{"$f":"Residential!$F$61","v":"Yes"},{"$f":"Residential!$F$62","v":"Yes"},{"$f":"Residential!$F$63","v":"No"},{"$f":"Residential!$F$64","v":"No"},{"$f":"Residential!$F$65","v":"No"},{"$f":"Residential!$M$50","v":0},{"$f":"Residential!$M$51","v":0},{"$f":"Residential!$M$52","v":0},{"$f":"Residential!$M$53","v":0},{"$f":"Residential!$E$37","v":0},{"$f":"Residential!$G$37","v":0},{"$f":"Residential!$I$37","v":0},{"$f":"Residential!$K$37","v":0},{"$f":"Residential!$M$37","v":0},{"$f":"Residential!$O$37","v":0},{"$f":"Residential!$E$39","v":0},{"$f":"Residential!$G$39","v":0},{"$f":"Residential!$I$39","v":0},{"$f":"Residential!$K$39","v":0},{"$f":"Residential!$M$39","v":0},{"$f":"Residential!$O$39","v":0},{"$f":"Residential!$R$39","v":0},{"$f":"Residential!$E$40","v":0},{"$f":"Residential!$G$40","v":0},{"$f":"Residential!$I$40","v":0},{"$f":"Residential!$K$40","v":0},{"$f":"Residential!$M$40","v":0},{"$f":"Residential!$O$40","v":0},{"$f":"Residential!$R$40","v":0},{"$f":"Residential!$R$41","v":0},{"$f":"Residential!$R$42","v":0},{"$f":"Residential!$R$43","v":0},{"$f":"BaselineAssessmentRate","v":5.5E-2},{"$f":"AssessmentLoading","v":0.02},{"$f":"CreditCardCommitments","v":3.8199999999999998E-2},{"$f":"WorkingsForNegativeGearing","v":6.0400000000000002E-2},{"$f":"OtherMortgageRepaymentBuffer","v":1.25},{"$f":"RentalIncomeShading","v":0.8},{"$f":"CompanyTax","v":0.25},{"$f":"ROUND(Residential!$E$71,2)","v":0},{"$f":"ROUND(Residential!$E$72,2)","v":0},{"$f":"ROUND(Residential!$E$73,2)","v":0},{"$f":"ROUND(Residential!$E$74,2)","v":0},{"$f":"ROUND(Residential!$E$75,2)","v":0},{"$f":"ROUND(Residential!$E$76,2)","v":0},{"$f":"ROUND(Residential!$G$71,2)","v":0},{"$f":"ROUND(Residential!$G$72,2)","v":0},{"$f":"ROUND(Residential!$G$73,2)","v":0},{"$f":"ROUND(Residential!$G$74,2)","v":0},{"$f":"ROUND(Residential!$G$75,2)","v":0},{"$f":"ROUND(Residential!$G$76,2)","v":0},{"$f":"ROUND(Residential!$M$71,2)","v":0},{"$f":"ROUND(Residential!$M$72,2)","v":0},{"$f":"ROUND(Residential!$M$73,2)","v":0},{"$f":"ROUND(Residential!$M$74,2)","v":0},{"$f":"ROUND(Residential!$M$75,2)","v":0},{"$f":"ROUND(Residential!$M$76,2)","v":0},{"$f":"ROUND(Residential!$O$71,2)","v":0},{"$f":"ROUND(Residential!$O$72,2)","v":0},{"$f":"ROUND(Residential!$O$73,2)","v":0},{"$f":"ROUND(Residential!$O$74,2)","v":0},{"$f":"ROUND(Residential!$O$75,2)","v":0},{"$f":"ROUND(Residential!$O$76,2)","v":0},{"$f":"Residential!$E$78","v":0},{"$f":"Residential!$E$79","v":"-"},{"$f":"Residential!$G$78","v":"INCOMPLETE"},{"$f":"Residential!$M$78","v":0},{"$f":"Residential!$M$79","v":"-"},{"$f":"Residential!$O$78","v":"INCOMPLETE"},{"$f":"IF(Residential!$M$85<>\"Incomplete\",ROUND(Residential!$M$85,2),Residential!$M$85)","v":"INCOMPLETE"}]

{"sheet":"Version Control","index":9,"n_rows":41,"n_cols":6,"rows_kept":41,"cut":false,"hidden":true,"merged":[]}
["Version","Created date","Date Effective","Created By","Approved By","Change"]
[2.5,null,null,null,null,"Assessment rate +1.00%\nCredit Card assess @2.00% of limit\nLiving Expenses:\nSingle - $10,650\nJoint - $15,480\nAdditional Adult - $3,500\nAdditional Children - $3,740\nRental Income – 85% of gross\n"]
[2.6,null,null,null,null,"Assessment rate +1.00%\nCredit Card assess @2.00% of limit\nLiving Expenses:\nSingle - $10,650\nJoint - $15,480\nAdditional Adult - $4,830\nAdditional Children - $3,740\nRental Income – 85% of gross\n"]
[2.7,null,null,null,null,"Assessment rate +1.00%\nCredit Card assess @2.00% of limit\nLiving Expenses:\nSingle - $10,650\nJoint - $15,480\nAdditional Adult - $3,500\nAdditional Children - $3,740\nRental Income – 85% of gross\n"]
[2.8]
[2.9,2008,null,null,null,"Assessment rate +1.50%\nCredit Card assess @2.00% of limit\nLiving Expenses:\nSingle - $11,500\nJoint - $16,500\nAdditional Adult - $5,000\nAdditional Children - $4,200\n"]
[3.2,2008,null,null,null,"Assessment rate +1.50%\nCredit Card assess @2.00% of limit\nLiving Expenses:\nSingle - $12,750\nJoint - $18,250\nAdditional Children - $4,600\n"]
[3.7,"2011-01-28",null,null,null,"Assessment rate +2.00%\nCredit Card assess @2.00% of limit\nLiving Expenses:\nSingle - $14,400\nJoint - $20,400\nAdditional Adult - $14,000\nAdditional Children - $5,240\nRental Income – 85% of gross\nOther Mortgage Payments – Actual Other Liabilities – Actual\n"]
[4.2]
[4.3,null,null,null,null,"Assessment rate +2.00%\nCredit Card assess @2.00% of limit\nLiving Expenses:\nSingle - $15,564\nJoint - $22,620\nEach Dep Child - $5,520\nRental Income – 100% of gross\nOther Mortgage Payments – Actual Other Liabilities – Actual\n"]
[4.5,null,null,null,null,"Assessment rate +2.00%\nCredit Card assess @2.00% of limit\nLiving Expenses:\nSingle - $15,564\nJoint - $22,620\nEach Dep Child - $5,520\nRental Income – 100% of gross\nOther Mortgage Payments – Actual Other Liabilities – Actual\n"]
[4.5999999999999996,null,null,null,null,"Assessment rate +2.00%\nCredit Card assess @2.00% of limit\nLiving Expenses:\nSingle - $15,564\nJoint - $22,620\nEach Dep Child - $5,520\nRental Income – 100% of gross\nOther Mortgage Payments – Actual Other Liabilities – Actual\n"]
[4.92,"2015-09-01",null,null,null,"Assessment rate +2.00% or Floor of 7.20%\nCredit Card assess @3.00% of limit\nLiving Expenses:\nSingle - $15,564\nJoint - $26,724\nAdditional Children - $5,520\nRental Income – 80% of gross\nOther Mortgage Payments - +20%\nOther Liabilities – Actual\n"]
[4.93]
[4.9400000000000004]
[4.96]
[4.97,"2018-03-18","2018-05-28","Neil Culkin","Neil Culkin","Version control added\nAdopted LIXI+ living expense categorisation. \nRemoved mandatory fields for living expenses (broker version only)\nAdded FY2018 tax rates (brackets 3 & 4 income ranges)\nUpdated HPI per latest rates (Q4 2017) from Melbourne Institute \nNegative gearing benefit removed for Untaxed income and Add Backs (F39 & F40)\nP&I repayment now being quoted (E55 & E57)\nRepayment formula’s updated to PMT (I8 & J8)\nMandatory entry of cells for living expenses removed as broker get confused when not applicable. E29 & F29 deleted and B40 changed from 8 to 7 (“rates” sheet)\nAdded comments, extracts from and links to the ATO website in the ‘rates’ tab to explain that there are separate 2 calculations at play, now reflected in the tax calculation (I32:I37) for the broker version:\n Tax Offset for Low income earners\n Medicare levy calculation and Medicare Levy reduction for Low Income earners\n\n"]
[4.97,"2018-05-28","2018-05-28","Neil Culkin","Neil Culkin","Cell D9 amended from \"Loan Term:\" to \"Loan Term (years)\""]
[4.9800000000000004,"2018-07-17","2018-08-13","Neil Culkin","Neil Culkin","Cell B8 now includes commentary that loan amount includes capitalised fee (effective 16/7/2018)\nRequirement for DSR < 50% removed to align with policy\nNSR must be at least 1.35x for LVR > 90%"]
[4.9809999999999999,null,"2018-10-15",null,null,"New internal loan assessment template"]
[5,null,"2019-01-01","Neil Culkin","Credit Committee","Calculator restructured to cater for 2018 Q1 HEM Living Expense\nCRE calculator created\nOther mortgage repayments will be loaded by 25% up from 20%\nIncome for 32.5% tax bracket increase from $87,000 to $90,000\nNegative gearing calculation rate increased to 4.8% to match market offer\n"]
[5.0999999999999996,"2019-04-04","2019-04-17","Devika Dharmapalan ","Neil Culkin","1) A pop up box is to appear on the calculator in the below highlighted area if: The customer declared living expenses (cell R41) is less than 90% of the benchmark (cell R40) AND NSR (cell M75) < 1.5x OR The assessed NSR (cell M75) is ≥1.00 and ≤1.10x AND R40 > R41 The message is to state “To assist Pepper in verifying the customer living expenses, please provide last 3 months transaction bank statements”\n2) Set to True,  \"Is An Applicant\" Cell in both Residential and CRE Tabs, when an applicant exsist but income column is blank or zero\n3) Change Tab Name \"CRE\" to \"Commercial\" and change the heading from \"CRE Serviciability Calculator\" to \"Commercial Servicability Calculator\"\n4) Add new Tab \"Assessment Notes - Commercial\"\n5) Change Tab Name \"Assessment Notes\" to \"Assessment Notes - Residential\"\n6) Change Tab Name \"User Guide - CRE\" to \"User Guide Commercial\"\n7) Change All Macrose to Refer \"Commercial\" tab instead of \"CRE\"\n8) Remove \"Lease Doc\" option from Documnetation Type Field in \"Commercial Tab\"\n9) Devika added the contents provided by Paul Dean to \"Assessment Notes -Commercial\"\n10) Commercial tab - Cell E,G,I,K 52 amended to use income as E,G,I,K 47 less tax instead of E,G,I,K 66. Total taxable Income has to do with the income bracket used to determine the corresponding HEM living expense whereas the total income is what should be used for servicing\n11) Eligible and maximum borrowing amounts (M82 & M83) to note minimum amount of $0"]
[5.2,"2018-06-05",null,"Neil Culkin","Credit Committee","1) BBS & BAS calculator updated\n2) Credit card repayment calculation amended from 3% to 3.82% which as a proxy for assessing a credit card limit being ammortised over 3 years at an interest rate of 22%"]
[5.3,"2019-09-23","2019-10-01","Mick Sedgers","Neil Culkin","1. Reduce Assessment benchmark interest rate to 5.85% (Floor Rate) and Assessment buffer to be increased to 2.50%.\n2. reduce the negative gearing interest rate to 4.06%"]
[5.4,"2020-01-06","2020-03-30","Neil Culkin ","Neil Culkin","1. Living Expense Benchmark updated to HEM Q4 2019\n2. Adjusted Company Tax rate from 30% to 27.5%. This applies to companies with turnovers < $50m which aligns to the Pepper customer profile. \n3. Adjusted CRE ICR & DSCR ratio's changed to 3 decimal places to allow for rounding to the required ICR & DSCR which is on a two declimal point basis. \n4. Fix error: DSR calculation was deducting rental expense (cell M50) from the numerator in the calculation on a monthly basis instead of annual resulting in a over-statement of debt in the calculation. Amended to annual figure.\n5. Reduce the negative gearing interest rate to 3.67%"]
[5.5,"2020-06-22","2020-07-01","Neil Culkin","Neil Culkin","1. Removal of Self employed 1.25 NSR requirement in notes\n2. Adjustment of Company tax from 27.5% to 26% for FY21 tax rates\n3. Addition of Trust question in underwriter templates\n4. Correction in Rental Schedule to calculate share for DSC from 100% column J) and not buffered (column L).\n5. Addition to Rental Schedule to calculate Investment Loan amount for each borrower (columns O & P)\n5. Add 2 additional borrowers in rental Schedule"]
[5.6,"2020-09-10","2020-09-17","Neil Culkin","Neil Culkin","1. Reduce Assessment benchmark interest rate to 5.50% (Floor Rate)\n2. Living Expense Benchmark updated to HEM Q2 2020"]
[5.7,"2020-10-23","2020-11-12","Devika Dharmapalan ","Neil Culkin","1. Updated FY 2021 personal tax rates\n2. Ability to enter to Pepper loan amounts for serviceability (Residential)\n3. Re-introduction of construction loan NSR requirement note\n4. CRE Better Choice calculator with ICR/DSCR \"Refer to BDM\" message\n5. Business name entered to SEIC sheet"]
[5.8,"2021-05-24","2021-08-16","Neil Culkin","Neil Culkin","1. Living Expense Benchmark updated to HEM Q1 2021\n2. Reduce negative gearing interest rate to 3.29%\n3. Correction in Maximum Serviceable Loan Amount formula as the maximum IO term was being conservatively applied to all splits. \n4. Updated Compant Tax rate from 26.00% to 25.00% \n5. Assessment note template changes to include Greater Sydney COVID impact assessment and change Credit File Summary to adverse credit assessment"]
["5.8a","2021-08-26","2021-08-26","Neil Culkin","Neil Culkin","1. Addition of Jackson Data Entry tab (Internal Credit Version only)"]
["5.8b","2021-08-30","2021-08-30","Neil Culkin","Neil Culkin","1. COVID Impact Assessment expanded to include VIC (Internal Credit Version only)"]
["5.8c","2021-12-02","2021-12-02","Neil Culkin","Neil Culkin","1. COVID Impact Assessment removed (Internal Credit Version only)"]
["5.8d","2022-03-02","2022-03-02","Neil Culkin","Neil Culkin","1. CRE maxium loan term adjusted from 25 to 30 years"]
[5.9,"2022-04-08","Release with 6.0 v2","Neil Culkin & Devika Dharmapalan ","Neil Culkin","1. Removal on construction loan 1.10x NSR requirement\n2. Addition of 1.25x NSR requirement when aggreated loan > $1.5m and aggregated LVR > 70%\n3. HEM updated to Q42021\n4. Company name updated to Pepper Money Ltd.\n5. \"Assessment Notes - Residential\" sheet deleted\n6. Change the text from “To assist in verifying the customers living expenses, please provide last 3 months transaction bank statements” to “The living expenses declared by the customer are at risk of being understated when compared to a living expense benchmark. A Level 5 Pepper DCA holder will be required to approve this application”.\n7. Change the logic for the text of point 1 to appear only when the NSR is < 1.5x AND the ‘Compared to HEM’ expenses (per below table) are < 80% of the benchmark.  \n8. Amened the 'Living Expense Used' field (R42) formula to = [Higher of 'Compared to HEM' expenses & HEM] + [Expenses not 'Compared to HEM' excluding Investment property costs] + [Investment Property costs - (Rental Income x 15%)].  Changed Formula R42 in Residential Tab from \"=MAX(R40:R41)\" to =MAX(R40,E41)+K41+MAX(0,((G52*12)-(R25*15%)))\n9. Amended Living Expense categories and included differentiation as to which categoreis are compared to HEM and which are added to the higher of (those categories compared to HEM and HEM)\n10. Adjusted the \"Data\" tab to include new living expense categories\n11. Adjusted the Test Cases tab to include new living expense categories\n12. Correction of cell B7 on 'Jackson Data Entry' sheet to pick up benchmark and not LE result. This was applied in v5.8(d) for CRE. \n13. 'User Guide - Residential' updated to include new or amended categories"]
[6,"2022-05-24","Release with 6.0 v2","Neil Culkin","Neil Culkin","1. Update HEM benchmark from Q421 to Q122"]
["6.0 v2","2022-06-20","2022-07-01","Neil Culkin","Neil Culkin","1. 'Residential' tab, Workings for Negative Gearing (cells E33, G33, I33, K33, M33, O33) corrected to deduct G52 (investment property expenses) not G51 (body corporate & land tax expenses)"]
["6.0 v3","2022-06-20","2022-07-01","Neil Culkin","Neil Culkin","1. 'Residential' tab, Workings for Negative Gearing (cells E33, G33, I33, K33, M33, O33) corrected to deduct G52 (investment property expenses) not G51 (body corporate & land tax expenses)"]
[6.1,"2022-07-19","2023-02-01","Neil Culkin","Neil Culkin","1. Update HEM benchmark from Q122 to Q322\n2. Update Superannuation addback label on SEIC from 9% to 10.50%\n3. Inclusion of First Home Buyer Choice property tax into the living expense definitions"]
[6.2,"2023-05-17","2023-07-01","Neil Culkin","Neil Culkin","1. Update HEM benchmark from Q322 to Q123\n2. Reduce negative gearing interest rate to 6.04%\n3. Tax tables updated (medicare levy and low income tax offset)\n4. Release of BBS & BAS calculator to brokers"]
[6.3,"2023-07-28","2023-08-04","Neil Culkin","Neil Culkin","1. Introduction of 1% interest buffer with specific eligbility\n2. Interest rate buffer adjusted from 2.5% to 2% (Residential Lending programs only, CRE not included)\n3. Adjustment of NSR requirement for > 90% LVR loans from 1.35 to 1.25x"]
[6.4,"2023-10-06","2023-10-31","Neil Culkin","Neil Culkin","1. Update HEM benchmark from Q123 to Q223\n2. Commercial: Minimum ICR removed\n3. Commercial: Minimum DSCR amended to 1x Fulldoc & Leasedoc and 1.2x for Altdoc\n4. Commercial: Assessment rate introduced being higher of floor rate and actual rate + 2%\n5. Better Choice commercial serviceability calculator deleted\n6. Row 51 (commercial calculator) updated to include the same tax offset formula as residential calculator. "]

{"sheet":"CommercialData","index":10,"n_rows":3,"n_cols":113,"rows_kept":3,"cut":false,"hidden":true,"merged":[]}
["Proposed Loan Details",null,null,null,null,"Business Loan Details",null,null,null,null,null,null,null,null,null,null,null,"Business Income / Expenses (Income)",null,null,"Business Income / Expenses (Add Backs)",null,null,null,null,"Personal Income / Expenses",null,null,null,null,null,null,null,null,null,null,null,null,null,null,null,null,null,null,null,null,null,null,null,null,null,null,null,null,null,null,null,null,null,null,null,null,null,null,null,null,null,null,null,null,null,null,null,null,null,null,null,null,null,null,"Calculation",null,null,null,null,null,null,null,null,null,null,null,null,null,null,null,null,null,"Inputs",null,null,null,null,null,null,"Results"]
["New Loan Amount","Interest Rate","Documentation Type","Loan Term (Years)","I/O Term (Years)","Loan Amount 1","Rate 1","Actual Loan Repayment (Monthly) 1","Loan Amount 2","Rate 2","Actual Loan Repayment (Monthly) 2","Loan Amount 3","Rate 3","Actual Loan Repayment (Monthly) 3","Loan Amount 4","Rate 4","Actual Loan Repayment (Monthly) 4","Net Profit Before Tax","Proposed Net CRE Rental Income","Proposed Gross Residential Rental Income","Depreciation","Ammortisation","Interest Paid","Directors Salaries/ Fees / Super","Other","Status Applicant 1","Status Applicant 2","Status Applicant 3","Status Applicant 4","Couple with  Applicant 1","Couple with  Applicant 2","Couple with  Applicant 3","Couple with  Applicant 4","Dependent Applicant 1","Dependent Applicant 2","Dependent Applicant 3","Dependent Applicant 4","Gross Annual Income Applicant 1","Gross Annual Income Applicant 2","Gross Annual Income Applicant 3","Gross Annual Income Applicant 4","Untaxed Allowable Income Applicant 1","Untaxed Allowable Income Applicant 2","Untaxed Allowable Income Applicant 3","Untaxed Allowable Income Applicant 4","Gross Residential Rental Income (Other) Applicant 1","Gross Residential Rental Income (Other) Applicant 2","Gross Residential Rental Income (Other) Applicant 3","Gross Residential Rental Income (Other) Applicant 4","Investment Property Loan Balance (personal name) Applicant 1","Investment Property Loan Balance (personal name) Applicant 2","Investment Property Loan Balance (personal name) Applicant 3","Investment Property Loan Balance (personal name) Applicant 4","Living Expenses Monthly (Declared Living Expenses)","Rent/Board","Total Credit Card Limit","Personal Mortgage Repayments","Other Consumer Debt","P&I Repayment","IO Repayment","Earning Before Interest, Tax, Depreciation & Ammortisation (EBITDA)"," Total Add Backs","Total Income Applicant 1","Total Income Applicant 2","Total Income Applicant 3","Total Income Applicant 4","Total Gross Annual Income of All Applicants","Tax Applicant 1","Tax Applicant 2","Tax Applicant 3","Tax Applicant 4","Tax offset for Low Income Earners Applicant 1","Tax offset for Low Income Earners Applicant 2","Tax offset for Low Income Earners Applicant 3","Tax offset for Low Income Earners Applicant 4","Total Net Annual Income Applicant 1","Total Net Annual Income Applicant 2","Total Net Annual Income Applicant 3","Total Net Annual Income Applicant 4","Total Net Annual Income of All Applicants","Total Taxable Income Applicant 1","Total Taxable Income Applicant 2","Total Taxable Income Applicant 3","Total Taxable Income Applicant 4","Total Taxable Income For All Applicants","Spouse Income Applicant 1","Spouse Income Applicant 2","Spouse Income Applicant 3","Spouse Income Applicant 4","Hem Living Expense Applicant 1","Hem Living Expense Applicant 2","Hem Living Expense Applicant 3","Hem Living Expense Applicant 4","Hem Living Expense Total","Customer Nominated Living Expenses","Used Living Expenses","Personal rent","Personal Debt","Baseline Assessment Rate","Assessment Loading","Credit Card Commitments","Workings for Negative Gearing","Other Mortgage Repayment Buffer","Rental Income Shading","Company Tax","Business income (EBITDA + net personal contribution)","Interest Expenses","Debt Repayments","Interest Coverage Ratio (ICR) %","Debt Service Coverage Ratio (DSCR) %","Interest Coverage Ratio (ICR) Flag","Debt Service Coverage Ratio (DSCR) Flag","Application Status Flag"]
[{"$f":"Commercial!$E$8","v":0},{"$f":"Commercial!$I$8","v":0},{"$f":"Commercial!$E$9","v":0},{"$f":"Commercial!$I$9","v":0},{"$f":"Commercial!$I$10","v":0},{"$f":"Commercial!$E$18","v":0},{"$f":"Commercial!$G$18","v":0},{"$f":"Commercial!$I$18","v":0},{"$f":"Commercial!$E$19","v":0},{"$f":"Commercial!$G$19","v":0},{"$f":"Commercial!$I$19","v":0},{"$f":"Commercial!$E$20","v":0},{"$f":"Commercial!$G$20","v":0},{"$f":"Commercial!$I$20","v":0},{"$f":"Commercial!$E$21","v":0},{"$f":"Commercial!$G$21","v":0},{"$f":"Commercial!$I$21","v":0},{"$f":"Commercial!$E$27","v":0},{"$f":"Commercial!$E$28","v":0},{"$f":"Commercial!$E$29","v":0},{"$f":"Commercial!$K$27","v":0},{"$f":"Commercial!$K$28","v":0},{"$f":"Commercial!$K$29","v":0},{"$f":"Commercial!$K$30","v":0},{"$f":"Commercial!$K$31","v":0},{"$f":"Commercial!$E$39","v":0},{"$f":"Commercial!$G$39","v":0},{"$f":"Commercial!$I$39","v":0},{"$f":"Commercial!$K$39","v":0},{"$f":"Commercial!$E$40","v":0},{"$f":"Commercial!$G$40","v":0},{"$f":"Commercial!$I$40","v":0},{"$f":"Commercial!$K$40","v":0},{"$f":"Commercial!$E$41","v":0},{"$f":"Commercial!$G$41","v":0},{"$f":"Commercial!$I$41","v":0},{"$f":"Commercial!$K$41","v":0},{"$f":"Commercial!$E$44","v":0},{"$f":"Commercial!$G$44","v":0},{"$f":"Commercial!$I$44","v":0},{"$f":"Commercial!$K$44","v":0},{"$f":"Commercial!$E$45","v":0},{"$f":"Commercial!$G$45","v":0},{"$f":"Commercial!$I$45","v":0},{"$f":"Commercial!$K$45","v":0},{"$f":"Commercial!$E$46","v":0},{"$f":"Commercial!$G$46","v":0},{"$f":"Commercial!$I$46","v":0},{"$f":"Commercial!$K$46","v":0},{"$f":"Commercial!$E$49","v":0},{"$f":"Commercial!$G$49","v":0},{"$f":"Commercial!$I$49","v":0},{"$f":"Commercial!$K$49","v":0},{"$f":"Commercial!$E$55","v":0},{"$f":"Commercial!$K$55","v":0},{"$f":"Commercial!$K$56","v":0},{"$f":"Commercial!$K$57","v":0},{"$f":"Commercial!$K$58","v":0},{"$f":"Commercial!$I$11","v":0},{"$f":"Commercial!$I$12","v":0},{"$f":"Commercial!$E$33","v":0},{"$f":"Commercial!$K$33","v":0},{"$f":"Commercial!$E$47","v":0},{"$f":"Commercial!$G$47","v":0},{"$f":"Commercial!$I$47","v":0},{"$f":"Commercial!$K$47","v":0},{"$f":"Commercial!$P$47","v":0},{"$f":"Commercial!$E$50","v":0},{"$f":"Commercial!$G$50","v":0},{"$f":"Commercial!$I$50","v":0},{"$f":"Commercial!$K$50","v":0},{"$f":"Commercial!$E$51","v":0},{"$f":"Commercial!$G$51","v":0},{"$f":"Commercial!$I$51","v":0},{"$f":"Commercial!$K$51","v":0},{"$f":"Commercial!$E$52","v":0},{"$f":"Commercial!$G$52","v":0},{"$f":"Commercial!$I$52","v":0},{"$f":"Commercial!$K$52","v":0},{"$f":"Commercial!$P$52","v":0},{"$f":"Commercial!$E$66","v":0},{"$f":"Commercial!$G$66","v":0},{"$f":"Commercial!$I$66","v":0},{"$f":"Commercial!$K$66","v":0},{"$f":"Commercial!$P$66","v":0},{"$f":"Commercial!$E$67","v":0},{"$f":"Commercial!$G$67","v":0},{"$f":"Commercial!$I$67","v":0},{"$f":"Commercial!$K$67","v":0},{"$f":"Commercial!$E$69","v":0},{"$f":"Commercial!$G$69","v":0},{"$f":"Commercial!$I$69","v":0},{"$f":"Commercial!$K$69","v":0},{"$f":"Commercial!$P$69","v":0},{"$f":"Commercial!$P$70","v":0},{"$f":"Commercial!$P$71","v":0},{"$f":"Commercial!$P$72","v":0},{"$f":"Commercial!$P$73","v":0},{"$f":"BaselineAssessmentRate","v":5.5E-2},{"$f":"AssessmentLoading","v":0.02},{"$f":"CreditCardCommitments","v":3.8199999999999998E-2},{"$f":"WorkingsForNegativeGearing","v":6.0400000000000002E-2},{"$f":"OtherMortgageRepaymentBuffer","v":1.25},{"$f":"RentalIncomeShading","v":0.8},{"$f":"CompanyTax","v":0.25},{"$f":"Commercial!$E$81","v":0},{"$f":"Commercial!$I$81","v":0},{"$f":"Commercial!$I$82","v":0},{"$f":"Commercial!$I$85","v":0},{"$f":"Commercial!$I$86","v":0},{"$f":"Commercial!$K$85","v":0},{"$f":"Commercial!$K$86","v":"INCOMPLETE"},{"$f":"Commercial!$I$89","v":"INCOMPLETE"}]

{"sheet":"CommercialTestCases","index":11,"n_rows":15,"n_cols":174,"rows_kept":15,"cut":false,"hidden":true,"merged":[[0,113,0,167],[0,0,0,57],[0,58,0,112]]}
["Test Cases TestCases TestCases TestCases TestCases TestCases TestCases TestCases TestCases TestCases TestCases TestCases TestCases TestCases TestCases TestCases TestCases TestCases TestCases TestCases TestCases TestCases TestCases TestCases TestCases TestCases TestCases TestCases TestCases  TestCases TestCases TestCases TestCases TestCases TestCases TestCases TestCases TestCases TestCases TestCases TestCases TestCases TestCases TestCases TestCases TestCases TestCases TestCases TestCases TestCases TestCases TestCases TestCases TestCases TestCases TestCases TestCases TestCases TestCases TestCases TestCases TestCases TestCases TestCases TestCases TestCases TestCases TestCases TestCases TestCases TestCases TestCases TestCases TestCases TestCases TestCases TestCases TestCases TestCases TestCases TestCases TestCases TestCases TestCases ",null,null,null,null,null,null,null,null,null,null,null,null,null,null,null,null,null,null,null,null,null,null,null,null,null,null,null,null,null,null,null,null,null,null,null,null,null,null,null,null,null,null,null,null,null,null,null,null,null,null,null,null,null,null,null,null,null,"Original-Result-set Original-Result-set Original-Result-set Original-Result-set Original-Result-set Original-Result-set Original-Result-set Original-Result-set Original-Result-set Original-Result-set Original-Result-set Original-Result-set Original-Result-set Original-Result-set Original-Result-set Original-Result-set Original-Result-set Original-Result-set Original-Result-set Original-Result-set Original-Result-set Original-Result-set Original-Result-set Original-Result-set Original-Result-set Original-Result-set Original-Result-set Original-Result-set Original-Result-set Original-Result-set Original-Result-set Original-Result-set Original-Result-set",null,null,null,null,null,null,null,null,null,null,null,null,null,null,null,null,null,null,null,null,null,null,null,null,null,null,null,null,null,null,null,null,null,null,null,null,null,null,null,null,null,null,null,null,null,null,null,null,null,null,null,null,null,null,"New-Resultset New-Resultset New-Resultset New-Resultset New-Resultset New-Resultset New-Resultset New-Resultset New-Resultset New-Resultset New-Resultset New-Resultset New-Resultset New-Resultset New-Resultset New-Resultset New-Resultset New-Resultset  New-Resultset  New-Resultset  New-Resultset  New-Resultset  New-Resultset  New-Resultset  New-Resultset New-Resultset New-Resultset",null,null,null,null,null,null,null,null,null,null,null,null,null,null,null,null,null,null,null,null,null,null,null,null,null,null,null,null,null,null,null,null,null,null,null,null,null,null,null,null,null,null,null,null,null,null,null,null,null,null,null,null,null,null,"Test cases will run when date tested is blank and Run Scenario Flag is \"Y\""]
["New Loan Amount","Interest Rate","Documentation Type","Loan Term (Years)","I/O Term (Years)","Loan Amount 1","Rate 1","Actual Loan Repayment (Monthly) 1","Loan Amount 2","Rate 2","Actual Loan Repayment (Monthly) 2","Loan Amount 3","Rate 3","Actual Loan Repayment (Monthly) 3","Loan Amount 4","Rate 4","Actual Loan Repayment (Monthly) 4","Net Profit Before Tax","Proposed Net CRE Rental Income","Proposed Gross Residential Rental Income","Depreciation","Ammortisation","Interest Paid","Directors Salaries/ Fees / Super","Other","Status Applicant 1","Status Applicant 2","Status Applicant 3","Status Applicant 4","Couple with  Applicant 1","Couple with  Applicant 2","Couple with  Applicant 3","Couple with  Applicant 4","Dependent Applicant 1","Dependent Applicant 2","Dependent Applicant 3","Dependent Applicant 4","Gross Annual Income Applicant 1","Gross Annual Income Applicant 2","Gross Annual Income Applicant 3","Gross Annual Income Applicant 4","Untaxed Allowable Income Applicant 1","Untaxed Allowable Income Applicant 2","Untaxed Allowable Income Applicant 3","Untaxed Allowable Income Applicant 4","Gross Residential Rental Income (Other) Applicant 1","Gross Residential Rental Income (Other) Applicant 2","Gross Residential Rental Income (Other) Applicant 3","Gross Residential Rental Income (Other) Applicant 4","Investment Property Loan Balance (personal name) Applicant 1","Investment Property Loan Balance (personal name) Applicant 2","Investment Property Loan Balance (personal name) Applicant 3","Investment Property Loan Balance (personal name) Applicant 4","Living Expenses Monthly (Declared Living Expenses)","Rent/Board","Total Credit Card Limit","Personal Mortgage Repayments","Other Consumer Debt","P&I Repayment","IO Repayment","Earning Before Interest, Tax, Depreciation & Ammortisation (EBITDA)"," Total Add Backs","Total Income Applicant 1","Total Income Applicant 2","Total Income Applicant 3","Total Income Applicant 4","Total Gross Annual Income of All Applicants","Tax Applicant 1","Tax Applicant 2","Tax Applicant 3","Tax Applicant 4","Tax offset for Low Income Earners Applicant 1","Tax offset for Low Income Earners Applicant 2","Tax offset for Low Income Earners Applicant 3","Tax offset for Low Income Earners Applicant 4","Total Net Annual Income Applicant 1","Total Net Annual Income Applicant 2","Total Net Annual Income Applicant 3","Total Net Annual Income Applicant 4","Total Net Annual Income of All Applicants","Total Taxable Income Applicant 1","Total Taxable Income Applicant 2","Total Taxable Income Applicant 3","Total Taxable Income Applicant 4","Total Taxable Income For All Applicants","Spouse Income Applicant 1","Spouse Income Applicant 2","Spouse Income Applicant 3","Spouse Income Applicant 4","Hem Living Expense Applicant 1","Hem Living Expense Applicant 2","Hem Living Expense Applicant 3","Hem Living Expense Applicant 4","Hem Living Expense Total","Customer Nominated Living Expenses","Used Living Expenses","Personal rent","Personal Debt","Baseline Assessment Rate","Assessment Loading","Credit Card Commitments","Workings for Negative Gearing","Other Mortgage Repayment Buffer","Rental Income Shading","Company Tax","Business income (EBITDA + net personal contribution)","Interest Expenses","Debt Repayments","Interest Coverage Ratio (ICR) %","Debt Service Coverage Ratio (DSCR) %","Interest Coverage Ratio (ICR) Flag","Debt Service Coverage Ratio (DSCR) Flag","Application Status Flag","P&I Repayment","IO Repayment","Earning Before Interest, Tax, Depreciation & Ammortisation (EBITDA)"," Total Add Backs","Total Income Applicant 1","Total Income Applicant 2","Total Income Applicant 3","Total Income Applicant 4","Total Gross Annual Income of All Applicants","Tax Applicant 1","Tax Applicant 2","Tax Applicant 3","Tax Applicant 4","Tax offset for Low Income Earners Applicant 1","Tax offset for Low Income Earners Applicant 2","Tax offset for Low Income Earners Applicant 3","Tax offset for Low Income Earners Applicant 4","Total Net Annual Income Applicant 1","Total Net Annual Income Applicant 2","Total Net Annual Income Applicant 3","Total Net Annual Income Applicant 4","Total Net Annual Income of All Applicants","Total Taxable Income Applicant 1","Total Taxable Income Applicant 2","Total Taxable Income Applicant 3","Total Taxable Income Applicant 4","Total Taxable Income For All Applicants","Spouse Income Applicant 1","Spouse Income Applicant 2","Spouse Income Applicant 3","Spouse Income Applicant 4","Hem Living Expense Applicant 1","Hem Living Expense Applicant 2","Hem Living Expense Applicant 3","Hem Living Expense Applicant 4","Hem Living Expense Total","Customer Nominated Living Expenses","Used Living Expenses","Personal rent","Personal Debt","Baseline Assessment Rate","Assessment Loading","Credit Card Commitments","Workings for Negative Gearing","Other Mortgage Repayment Buffer","Rental Income Shading","Company Tax","Business income (EBITDA + net personal contribution)","Interest Expenses","Debt Repayments","Interest Coverage Ratio (ICR) %","Debt Service Coverage Ratio (DSCR) %","Interest Coverage Ratio (ICR) Flag","Debt Service Coverage Ratio (DSCR) Flag","Application Status Flag","Pass or Fail","Run Scenario Flag","Date Tested","Scenario","Sequence","Name "]
[1000000,0.05,"Full Doc",12,0,0,0,0,0,0,0,0,0,0,0,0,0,50000,70000,0,0,0,0,0,0,0,0,0,0,0,0,0,0,0,0,0,0,0,0,0,0,0,0,0,0,0,0,0,0,0,0,0,0,0,0,0,0,0,10283.81,0,120000,0,0,0,0,0,0,0,0,0,0,0,0,0,0,0,0,0,0,0,0,0,0,0,0,0,0,0,0,0,0,0,0,0,0,0,0,0,5.5E-2,0.02,3.8199999999999998E-2,6.0400000000000002E-2,1.25,0.8,0.25,120000,50000,123405.73,2.4,0.97240216185426642,null,"FAIL","COMPLETE",10283.81,0,120000,0,0,0,0,0,0,0,0,0,0,0,0,0,0,0,0,0,0,0,0,0,0,0,0,0,0,0,0,0,0,0,0,0,0,0,0,0,5.5E-2,0.02,3.8199999999999998E-2,6.0400000000000002E-2,1.25,0.8,0.25,120000,50000,123405.73,2.4,0.97240216185426642,null,"FAIL","COMPLETE",{"$f":"IF(AND(CC3=EF3,CD3=EG3,CE3=EH3,CF3=EI3,CG3=EJ3,CH3=EK3,CI3=EL3,CJ3=EM3,CK3=EN3,CL3=EO3,CM3=EP3,CN3=EQ3,CO3=ER3,CP3=ES3,CQ3=ET3,CR3=EU3,CS3=EV3,CT3=EW3,CU3=EX3,CV3=EY3,CW3=EZ3,CX3=FA3,CY3=FB3,CZ3=FC3,DA3=FD3,DB3=FE3,DC3=FF3,DD3=FG3,DE3=FH3,DF3=FI3,DG3=FJ3,DH3=FK3,DI3=FL3),\"Pass\",\"Fail\")","v":"Pass"},"Y","2023-10-25T13:49:08",null,"Case 1","Neil"]
[1000000,0.05,"Full Doc",15,3,0,0,0,0,0,0,0,0,0,0,0,0,50000,70000,0,0,0,0,0,0,"Individual (Couple)",0,0,0,"N/A",0,0,0,2,0,0,0,30000,0,0,0,0,0,0,0,0,0,0,0,0,0,0,0,2000,0,10000,0,1000,10283.81,5833.33,120000,0,30000,0,0,0,30000,2842,0,0,0,-700,0,0,0,27858,0,0,0,27858,30000,0,0,0,30000,0,0,0,0,37548.83,0,0,0,37548.83,24000,37548.83,0,16584,5.5E-2,0.02,3.8199999999999998E-2,6.0400000000000002E-2,1.25,0.8,0.25,93725.17,50000,123405.73,1.8745034222036285,0.75948799173084547,null,"FAIL","COMPLETE",10283.81,5833.33,120000,0,30000,0,0,0,30000,2842,0,0,0,-700,0,0,0,27858,0,0,0,27858,30000,0,0,0,30000,0,0,0,0,37548.83,0,0,0,37548.83,24000,37548.83,0,16584,5.5E-2,0.02,3.8199999999999998E-2,6.0400000000000002E-2,1.25,0.8,0.25,93725.17,50000,123405.73,1.8745034222036285,0.75948799173084547,null,"FAIL","COMPLETE","Pass","Y","2023-10-25T13:49:10",null,"Case 2","Neil"]
[1000000,0.05,"Full Doc",15,3,0,0,0,0,0,0,0,0,0,0,0,0,50000,70000,80000,0,0,0,0,0,"Individual (Couple)",0,0,0,"N/A",0,0,0,2,0,0,0,30000,0,0,0,0,0,0,0,0,0,0,0,0,0,0,0,4000,0,10000,0,1000,10283.81,5833.33,184000,0,30000,0,0,0,30000,2842,0,0,0,-700,0,0,0,27858,0,0,0,27858,30000,0,0,0,30000,0,0,0,0,37548.83,0,0,0,37548.83,48000,48000,0,16584,5.5E-2,0.02,3.8199999999999998E-2,6.0400000000000002E-2,1.25,0.8,0.25,147274,50000,123405.73,2.9454799999999999,1.1934129665410436,null,"PASS","COMPLETE",10283.81,5833.33,184000,0,30000,0,0,0,30000,2842,0,0,0,-700,0,0,0,27858,0,0,0,27858,30000,0,0,0,30000,0,0,0,0,37548.83,0,0,0,37548.83,48000,48000,0,16584,5.5E-2,0.02,3.8199999999999998E-2,6.0400000000000002E-2,1.25,0.8,0.25,147274,50000,123405.73,2.9454799999999999,1.1934129665410436,null,"PASS","COMPLETE","Pass","Y","2023-10-25T13:49:11",null,"Case 3","Neil"]
[1000000,0.05,"Alt Doc",12,0,0,0,0,0,0,0,0,0,0,0,0,0,50000,70000,0,0,0,0,0,0,0,0,0,0,0,0,0,0,0,0,0,0,0,0,0,0,0,0,0,0,0,0,0,0,0,0,0,0,0,0,0,0,0,10283.81,0,120000,0,0,0,0,0,0,0,0,0,0,0,0,0,0,0,0,0,0,0,0,0,0,0,0,0,0,0,0,0,0,0,0,0,0,0,0,0,5.5E-2,0.02,3.8199999999999998E-2,6.0400000000000002E-2,1.25,0.8,0.25,120000,50000,123405.73,2.4,0.97240216185426642,null,"FAIL","COMPLETE",10283.81,0,120000,0,0,0,0,0,0,0,0,0,0,0,0,0,0,0,0,0,0,0,0,0,0,0,0,0,0,0,0,0,0,0,0,0,0,0,0,0,5.5E-2,0.02,3.8199999999999998E-2,6.0400000000000002E-2,1.25,0.8,0.25,120000,50000,123405.73,2.4,0.97240216185426642,null,"FAIL","COMPLETE","Pass","Y","2023-10-25T13:49:12",null,"Case 4","Neil"]
[1000000,0.05,"Alt Doc",15,3,0,0,0,0,0,0,0,0,0,0,0,0,50000,70000,0,0,0,0,0,0,"Individual (Couple)",0,0,0,"N/A",0,0,0,2,0,0,0,30000,0,0,0,0,0,0,0,0,0,0,0,0,0,0,0,2000,0,10000,0,1000,10283.81,5833.33,120000,0,30000,0,0,0,30000,2842,0,0,0,-700,0,0,0,27858,0,0,0,27858,30000,0,0,0,30000,0,0,0,0,37548.83,0,0,0,37548.83,24000,37548.83,0,16584,5.5E-2,0.02,3.8199999999999998E-2,6.0400000000000002E-2,1.25,0.8,0.25,93725.17,50000,123405.73,1.8745034222036285,0.75948799173084547,null,"FAIL","COMPLETE",10283.81,5833.33,120000,0,30000,0,0,0,30000,2842,0,0,0,-700,0,0,0,27858,0,0,0,27858,30000,0,0,0,30000,0,0,0,0,37548.83,0,0,0,37548.83,24000,37548.83,0,16584,5.5E-2,0.02,3.8199999999999998E-2,6.0400000000000002E-2,1.25,0.8,0.25,93725.17,50000,123405.73,1.8745034222036285,0.75948799173084547,null,"FAIL","COMPLETE","Pass","Y","2023-10-25T13:49:14",null,"Case 5","Neil"]
[830000,9.8470000000000002E-2,"Full Doc",15,3,0,0,0,0,0,0,0,0,0,0,0,0,50000,70000,80000,0,0,0,0,0,"Individual (Couple)",0,0,0,"N/A",0,0,0,2,0,0,0,30000,0,0,0,0,0,0,0,0,0,0,0,0,0,0,0,4000,0,10000,0,1000,10824.63,8194.18,184000,0,30000,0,0,0,30000,2842,0,0,0,-700,0,0,0,27858,0,0,0,27858,30000,0,0,0,30000,0,0,0,0,37548.83,0,0,0,37548.83,48000,48000,0,16584,5.5E-2,0.02,3.8199999999999998E-2,6.0400000000000002E-2,1.25,0.8,0.25,147274,81730.100000000006,129895.52,1.8019554607176547,1.1337881617737096,null,"PASS","COMPLETE",10824.63,8194.18,184000,0,30000,0,0,0,30000,2842,0,0,0,-700,0,0,0,27858,0,0,0,27858,30000,0,0,0,30000,0,0,0,0,37548.83,0,0,0,37548.83,48000,48000,0,16584,5.5E-2,0.02,3.8199999999999998E-2,6.0400000000000002E-2,1.25,0.8,0.25,147274,81730.100000000006,129895.52,1.8019554607176547,1.1337881617737096,null,"PASS","COMPLETE","Pass","Y","2023-10-25T13:49:15",null,"Case 6","Neil"]
[832000,9.8470000000000002E-2,"Full Doc",15,3,0,0,0,0,0,0,0,0,0,0,0,0,50000,70000,80000,0,0,0,0,0,"Individual (Couple)",0,0,0,"N/A",0,0,0,2,0,0,0,30000,0,0,0,0,0,0,0,0,0,0,0,0,0,0,0,4000,0,10000,0,1000,10850.71,8213.92,184000,0,30000,0,0,0,30000,2842,0,0,0,-700,0,0,0,27858,0,0,0,27858,30000,0,0,0,30000,0,0,0,0,37548.83,0,0,0,37548.83,48000,48000,0,16584,5.5E-2,0.02,3.8199999999999998E-2,6.0400000000000002E-2,1.25,0.8,0.25,147274,81927.039999999994,130208.52,1.7976238370140065,1.1310627094617536,null,"PASS","COMPLETE",10850.71,8213.92,184000,0,30000,0,0,0,30000,2842,0,0,0,-700,0,0,0,27858,0,0,0,27858,30000,0,0,0,30000,0,0,0,0,37548.83,0,0,0,37548.83,48000,48000,0,16584,5.5E-2,0.02,3.8199999999999998E-2,6.0400000000000002E-2,1.25,0.8,0.25,147274,81927.039999999994,130208.52,1.7976238370140065,1.1310627094617536,null,"PASS","COMPLETE","Pass","Y","2023-10-25T13:49:16",null,"Case 7","Neil"]
[1000000,9.8470000000000002E-2,"Full Doc",15,3,0,0,0,0,0,0,0,0,0,0,0,0,50000,70000,80000,0,0,0,0,0,"Individual (Couple)",0,0,0,"N/A",0,0,0,2,0,0,0,30000,0,0,0,0,0,0,0,0,0,0,0,0,0,0,0,4000,0,10000,0,1000,13041.72,9872.5,184000,0,30000,0,0,0,30000,2842,0,0,0,-700,0,0,0,27858,0,0,0,27858,30000,0,0,0,30000,0,0,0,0,37548.83,0,0,0,37548.83,48000,48000,0,16584,5.5E-2,0.02,3.8199999999999998E-2,6.0400000000000002E-2,1.25,0.8,0.25,147274,98470,156500.62,1.4956230323956534,0.94104417427217879,null,"FAIL","COMPLETE",13041.72,9872.5,184000,0,30000,0,0,0,30000,2842,0,0,0,-700,0,0,0,27858,0,0,0,27858,30000,0,0,0,30000,0,0,0,0,37548.83,0,0,0,37548.83,48000,48000,0,16584,5.5E-2,0.02,3.8199999999999998E-2,6.0400000000000002E-2,1.25,0.8,0.25,147274,98470,156500.62,1.4956230323956534,0.94104417427217879,null,"FAIL","COMPLETE","Pass","Y","2023-10-25T13:49:17",null,"Case 8","Neil"]
[1000000,9.8479999999999998E-2,"Full Doc",15,3,0,0,0,0,0,0,0,0,0,0,0,0,50000,70000,80000,0,0,0,0,0,"Individual (Couple)",0,0,0,"N/A",0,0,0,2,0,0,0,30000,0,0,0,0,0,0,0,0,0,0,0,0,0,0,0,4000,0,10000,0,1000,13042.32,9873.33,184000,0,30000,0,0,0,30000,2842,0,0,0,-700,0,0,0,27858,0,0,0,27858,30000,0,0,0,30000,0,0,0,0,37548.83,0,0,0,37548.83,48000,48000,0,16584,5.5E-2,0.02,3.8199999999999998E-2,6.0400000000000002E-2,1.25,0.8,0.25,147274,98480,156507.85999999999,1.4954711616571892,0.94100063898610964,null,"FAIL","COMPLETE",13042.32,9873.33,184000,0,30000,0,0,0,30000,2842,0,0,0,-700,0,0,0,27858,0,0,0,27858,30000,0,0,0,30000,0,0,0,0,37548.83,0,0,0,37548.83,48000,48000,0,16584,5.5E-2,0.02,3.8199999999999998E-2,6.0400000000000002E-2,1.25,0.8,0.25,147274,98480,156507.85999999999,1.4954711616571892,0.94100063898610964,null,"FAIL","COMPLETE","Pass","Y","2023-10-25T13:49:18",null,"Case 9","Neil"]
[1000000,8.4400000000000003E-2,"Alt Doc",15,3,0,0,0,0,0,0,0,0,0,0,0,0,50000,70000,80000,0,0,0,0,0,"Individual (Couple)",0,0,0,"N/A",0,0,0,2,0,0,0,30000,0,0,0,0,0,0,0,0,0,0,0,0,0,0,0,4000,0,10000,0,1000,12206.35,8700,184000,0,30000,0,0,0,30000,2842,0,0,0,-700,0,0,0,27858,0,0,0,27858,30000,0,0,0,30000,0,0,0,0,37548.83,0,0,0,37548.83,48000,48000,0,16584,5.5E-2,0.02,3.8199999999999998E-2,6.0400000000000002E-2,1.25,0.8,0.25,147274,84400,146476.14000000001,1.7449526066350711,1.0054470342182766,null,"FAIL","COMPLETE",12206.35,8700,184000,0,30000,0,0,0,30000,2842,0,0,0,-700,0,0,0,27858,0,0,0,27858,30000,0,0,0,30000,0,0,0,0,37548.83,0,0,0,37548.83,48000,48000,0,16584,5.5E-2,0.02,3.8199999999999998E-2,6.0400000000000002E-2,1.25,0.8,0.25,147274,84400,146476.14000000001,1.7449526066350711,1.0054470342182766,null,"FAIL","COMPLETE","Pass","Y","2023-10-25T13:49:20",null,"Case 10","Neil"]
[1000000,8.43E-2,"Alt Doc",15,3,0,0,0,0,0,0,0,0,0,0,0,0,50000,70000,80000,0,0,0,0,0,"Individual (Couple)",0,0,0,"N/A",0,0,0,2,0,0,0,30000,0,0,0,0,0,0,0,0,0,0,0,0,0,0,0,4000,0,10000,0,1000,12200.51,8691.67,184000,0,30000,0,0,0,30000,2842,0,0,0,-700,0,0,0,27858,0,0,0,27858,30000,0,0,0,30000,0,0,0,0,37548.83,0,0,0,37548.83,48000,48000,0,16584,5.5E-2,0.02,3.8199999999999998E-2,6.0400000000000002E-2,1.25,0.8,0.25,147274,84300,146406.07,1.7470225385527878,1.0059282040116864,null,"FAIL","COMPLETE",12200.51,8691.67,184000,0,30000,0,0,0,30000,2842,0,0,0,-700,0,0,0,27858,0,0,0,27858,30000,0,0,0,30000,0,0,0,0,37548.83,0,0,0,37548.83,48000,48000,0,16584,5.5E-2,0.02,3.8199999999999998E-2,6.0400000000000002E-2,1.25,0.8,0.25,147274,84300,146406.07,1.7470225385527878,1.0059282040116864,null,"FAIL","COMPLETE","Pass","Y","2023-10-25T13:49:21",null,"Case 11","Neil"]
[1000000,0.05,"Full Doc",15,3,0,0,0,0,0,0,0,0,0,0,0,0,50000,70000,0,0,0,0,0,0,"Individual (Couple)",0,0,0,"N/A",0,0,0,2,0,0,0,55000,0,0,0,0,0,0,0,0,0,0,0,0,0,0,0,2000,0,10000,0,1000,10283.81,5833.33,120000,0,55000,0,0,0,55000,9442,0,0,0,-175,0,0,0,45733,0,0,0,45733,55000,0,0,0,55000,0,0,0,0,39287.65,0,0,0,39287.65,24000,39287.65,0,16584,5.5E-2,0.02,3.8199999999999998E-2,6.0400000000000002E-2,1.25,0.8,0.25,109861.35,50000,123405.73,2.1972269493862115,0.89024509819483622,null,"FAIL","COMPLETE",10283.81,5833.33,120000,0,55000,0,0,0,55000,9442,0,0,0,-175,0,0,0,45733,0,0,0,45733,55000,0,0,0,55000,0,0,0,0,39287.65,0,0,0,39287.65,24000,39287.65,0,16584,5.5E-2,0.02,3.8199999999999998E-2,6.0400000000000002E-2,1.25,0.8,0.25,109861.35,50000,123405.73,2.1972269493862115,0.89024509819483622,null,"FAIL","COMPLETE","Pass","Y","2023-10-25T13:49:22",null,"Case 12","Neil"]
[1000000,0.05,"Full Doc",15,3,0,0,0,0,0,0,0,0,0,0,0,0,50000,70000,0,0,0,0,0,0,"Individual (Couple)","Individual (Single)",0,0,"N/A",0,0,0,2,0,0,0,55000,100000,0,0,0,0,0,0,0,0,0,0,0,0,0,0,2000,0,10000,0,1000,10283.81,5833.33,120000,0,55000,100000,0,0,155000,9442,24967,0,0,-175,0,0,0,45733,75033,0,0,120766,55000,100000,0,0,155000,0,0,0,0,39287.65,26566.720000000001,0,0,65854.37,24000,65854.37,0,16584,5.5E-2,0.02,3.8199999999999998E-2,6.0400000000000002E-2,1.25,0.8,0.25,158327.63,50000,123405.73,3.1665525203297182,1.2829843818307058,null,"PASS","COMPLETE",10283.81,5833.33,120000,0,55000,100000,0,0,155000,9442,24967,0,0,-175,0,0,0,45733,75033,0,0,120766,55000,100000,0,0,155000,0,0,0,0,39287.65,26566.720000000001,0,0,65854.37,24000,65854.37,0,16584,5.5E-2,0.02,3.8199999999999998E-2,6.0400000000000002E-2,1.25,0.8,0.25,158327.63,50000,123405.73,3.1665525203297182,1.2829843818307058,null,"PASS","COMPLETE","Pass","Y","2023-10-25T13:49:23",null,"Case 13","Neil"]

{"sheet":"BBS & BAS","index":12,"n_rows":94,"n_cols":14,"rows_kept":94,"cut":false,"hidden":false,"merged":[[19,0,19,3],[19,10,19,13],[20,10,20,13],[14,0,14,3],[15,0,15,3],[16,0,16,3],[17,0,17,3],[18,0,18,3],[0,4,0,5],[21,10,21,13],[22,10,22,13],[23,10,23,13],[7,13,9,13],[18,5,18,7],[18,10,18,13],[12,7,13,7]]}
["Step 1","What income is your client declaring?"]
[]
["Step 2","Enter data in the white cells only",null,null,null,null,null,"Number of Quarters used"]
[null,null,null,null,null,null,null,{"$f":"COUNT(B7:B10)","v":0},null,null,"Business Bank Statements Analysis"]
["enter data in white cells only","G1","1A","1B","Net GST","W1","Expenses","Surplus","Expense Ratio",null,null,"Actuals"]
["Must use min of 2 quarters","Sales","Owed to ATO","Owed by ATO",null,"Salaries",null,null,null,null,"Select Period Covered"]
["Quarter 1",null,null,null,{"$f":"C7-D7","v":0},null,{"$f":"D7*11","v":0},{"$f":"B7-E7-F7-G7","v":0}]
["Quarter 2",null,null,null,{"$f":"C8-D8","v":0},null,{"$f":"D8*11","v":0},{"$f":"B8-E8-F8-G8","v":0},null,null,"Enter Sum of Credits",null,null,"Annualised Credits x ATO Average Expense figure"]
["Quarter 3",null,null,null,{"$f":"C9-D9","v":0},null,{"$f":"D9*11","v":0},{"$f":"B9-E9-F9-G9","v":0},null,null,"Annualised",{"$f":"IF(L6=\"Month\",L8*12,IF(L6=\"Quarter\",L8*4,IF(L6=\"6 months\",L8*2,L8)))","v":0}]
["Quarter 4",null,null,null,0,null,0,0]
["TOTAL",{"$f":"SUM(B7:B10)","v":0},{"$f":"SUM(C7:C10)","v":0},0,0,0,0,0,{"$f":"(E11+F11+G11)/B11","v":{"$error":"#DIV/0!"}}]
["Annualised",null,null,null,null,null,null,{"$f":"IF(H4=2,H11*2,IF(H4=3,H11/3*4,H11))","v":0},null,null,"Enter Sum of Business debits from BBS",0,"OR",{"$f":"L9*H18","v":0}]
["Result",null,null,null,null,null,null,{"$f":"IF(E1>H12, \"Refer\",\"Pass\")","v":"Pass"},null,null,"Annualised",{"$f":"IF(L6=\"Month\",L12*12,IF(L6=\"Quarter\",L12*4,IF(L6=\"6 months\",L12*2,L12)))","v":0}]
[null,null,null,null,null,null,null,null,null,null,"Or Annualised via ATO Average",{"$f":"N12","v":0}]
["BAS Guidelines:",null,null,null,null,"Expense Benchmark",null,"ATO",null,null,"Assessed Surplus",{"$f":"L9-L13-L14","v":0},null,{"$f":"L9-N12","v":0}]
["1. If the annualised surplus exceeds the self employed declared income, proceed with application. Use the declared income in the DSC.",null,null,null,null,"Which Industry?",null,null,null,null,null,{"$f":"IF(E1>L15, \"Refer\",\"Pass\")","v":"Pass"}]
["2. If the annualised surplus is less than the declared income,  use BBS to verify income. If that is also insufficient, discuss with broker and consider full doc approach.",null,null,null,null,"Total Exp/Turnover % Range",null,null,null,null,"Actual Expense Ratio",{"$f":"L13/L9","v":{"$error":"#DIV/0!"}}]
["3. If you are using the ATO guidance for industry normal surplus, please compare the surplus shown above to the range shown in the ATO table. ",null,null,null,null,"Avge Total Expenses %"]
["4. When Salaries are shown above, check the Self Employed Declaration form to see if applicants' disclose PAYG income. If not, it is to be taken the fuigure shown above is paid to employees, not the applicants. If so, it would be expected to be part or whole of what is declared at W1 on the BAS",null,null,null,null,"https://www.ato.gov.au/Business/Small-business-benchmarks/Benchmarks-A-Z/",null,null,null,null,"BBS  Guidelines:"]
["5. If any quarter's 1B - Owed by ATO is significantly larger than other quarters, ask broker to check if any one-off capital purchases were made that quarter as these may inflate the GST owed and therefore the proxy expenses we compute. If that is the case, please ask for documentary support of that purchase to confirm eg invoice, bank statement. ",null,null,null,null,"ATO Small Business Benchmarks",null,null,null,null,"1. Select the period  the bank statements cover"]
[null,null,null,null,null,"Which one do I use?",null,"tax returns",null,null,"2. Identify the business related deposits and expenses, add them up and enter that figure where shown."]
[null,null,null,null,null,null,null,"BAS expense ratio to fit within ATO Range",null,null,"3. If the annualised surplus exceeds the self employed declared income, proceed with application. Use the declared income in the DSC."]
[null,null,null,null,null,null,null,"ATO Average if no BBS expense figure used.",null,null,"4. If the annualised surplus is less than the declared income, you may need to use BAS to verify income. If that is also insufficient, discuss with broker and consider full doc approach."]
[null,null,null,null,null,null,null,null,null,null,"5. If you are using the ATO guidance for industry normal surplus, please use the average shown in the ATO table."]
[]
[]
[]
[]
[]
[]
[]
[]
[]
[]
[]
[]
[]
[]
[]
[]
[]
[]
[]
[]
[]
[]
[]
[]
[]
[]
[]
[]
[]
[]
[]
[]
[]
[]
[]
[]
[]
[]
[]
[]
[]
[]
[]
[]
[]
[]
[]
[]
[]
[]
[]
[]
[]
[]
[]
[]
[]
[]
[]
[]
[]
[]
[]
[]
[]
[]
[null,"Month"]
[null,"Quarter"]
[null,"6 months"]
[null,"12 months"]

{"sheet":"User Guide - Residential","index":13,"n_rows":43,"n_cols":2,"rows_kept":43,"cut":false,"hidden":false,"merged":[]}
["User Guide - Residential Serviceability Calculator"]
[]
["Field Name","Instruction"]
["Clear Form (BUTTON)","Allows the user to clear all input fields in the calculator"]
["Applicant Name","Applicants name"]
["Interest Rate Buffer","This field will default to Pepper interest rate buffer of 2%. Where the customer is eligible for a 1% interest rate buffer (refer to criteria), 1% should be selected in this field."]
["New Loan Amount","Mandatory field - Total loan amount including any capitalised fees. Two fields are available for where the customer has multiple loans or splits with varying interest rates or terms."]
["Interest Rate","Mandatory field - Actual interest rate of the proposed loan or split"]
["Loan Term","Mandatory field - The total loan term of the proposed loan (cannot exceed 30 years on Prime or 40 years on Near Prime or Specialist products)"]
["I/O Term","The interest only term of the proposed loan. Leave blank if not applicable (will not allow IO term to exceed 5 years)"]
["Status","Mandatory field - For each applicant of the loan, what is their marital status. Drop down selection of Single, Couple, Company. Note, if Company status all income will be calculated based on Company tax rates. "]
["Couple with","Mandatory field - Links applicants who are a couple for household income band selection for living expense benchmark. \nThis field must be correctly completed for both individuals of a couple, where one member of a couple is not correctly linked the living expense will be calculated as an additional couple living expense.\nDrop down selection N/A, Non-Loan Party or Applicant “X” when another Applicant is applied with a Couple status"]
["Dependents","Number of child dependents, aged < 18, the Applicant has. Each dependent child must only be entered once per couple. If a dependent is entered for both individuals of a couple, that dependent will be counted twice."]
["Gross Annual Income","The applicants income from acceptable taxable income sources"]
["Untaxed Allowable Income","Income from acceptable untaxed income sources such as Centrelink allowances. Tax is not calculated on this income"]
["Self Employed Income","Income from self-employed activities, this income is taxed at personal tax rates and should not be duplicated if this income has already been entered in Gross Annual Income. \nOptional Macro: Where the SEIC has been used and “Apply Values to Servicing Calculator” macro executed, this field will populate with the results from the SEIC"]
["Addbacks","Allowable addbacks to be entered such as depreciation or non-recurring expenses.\nOptional Macro: Where the SEIC has been used and “Apply Values to Servicing Calculator” macro executed, this field will populate with the results from the SEIC"]
["Business NPBT","Self employed income that is to be taxed at company tax rates."]
["Self-Employed Worksheet (BUTTON)","Takes user to the SEIC tab"]
["Gross Rental Income","Rental income entered at 100%. For the purposes of allowable income for serviceability, 80% of this income is used for servicing."]
["Investment Property Loan Balance","This is the total balance of investment loans held by the applicant. For tax purposes, negative gearing will be applied to the calculated taxable income. For company applicants, if this interest has been calculated in the SEIC then this field should not be populated."]
["Primary residence utilities, rates & expenses","Mandatory field - Include council rates, water, gas & electricity utility bills and regular maintenance where applicable for the applicants primary resdience. Assessment should account for these expenses giving account to the type of property (location, house or unit and size). "]
["Primary residence strata fees & land tax & FHB property tax","Mandatory field - Include any applicable Body Coporate or Strata Fees and Land Tax for the applicants primary place of residence. This also includes annual property tax payments due under the First Home Buyer Choice stamp duty scheme - the rate of this tax is $400 plus 0.3% of the property value (https://www.nsw.gov.au/initiative/first-home-buyer-choice)"]
["Investment property utilities, rates, strata fees & land tax","Mandatory field - Include council rates, water, gas & electricity utility bills, Body Corpoate or Strata Fees, Land Tax and regular maintenance where applicable for any investment properties or secondary residences owned or to be owned by the applicant. Assessment should account for these expenses giving account to the type of property (location, house or unit and size). "]
["Telephone, internet, Pay TV & media streaming","Mandatory field - Unless an applicant has a mobile phone supplied by their employer, it is expected that each applicant would have a mobile phone expense. If they have a home phone number, they may have a ‘bundle’ with a telco which includes internet."]
["Groceries","Mandatory field - It is expected that all applicants will have a grocery expense that is reasonable for their family unit size. "]
["Recreation & Entertainment","Mandatory field - It is expected that all applicants will have some form of recreation & entertainment cost. This includes alcohol, tobacco, gambling, restaurants and membership fees."]
["Clothing & Personal Care","Mandatory field - It is expected that all applicants will have clothing and personal care expenses that is reasonable for their family unit size. "]
["Medical & Health","Mandatory field - As an applicant’s age increase it is expected that medical and health costs will increase. In some case this cost may be $0 however given the customers circumstance it should be understood why through additional inquiry."]
["Transport","Mandatory field - It is expected that all applicants will have a transport cost that is reasonable for their assets and employment position. What are the running costs of each car owned including petrol and servicing or what are the costs of public transport where they commute for work. \nOne exception may be where an applicant has one car only which is provided by their employer or running costs are already include in novated lease payments."]
["Education - non Private schooling","Mandatory field - Where the applicant(s) has school aged children is the declared amount reasonable to cover public schools fees, uniform costs and books (if high school). "]
["Education - Private schooling","Mandatory field - Where the applicant(s) has school aged children that attend private schooles, is the declared amount reasonable to cover schools fees, uniform costs and books. "]
["Childcare ","Mandatory field - Where the applicant(s) has pre-school aged children and all applicants work, has a child care cost been included that is reasonable for the location accounting for any rebate that may be due. Where this is applicable and declared expense is $0 additional inquiry needs to be made."]
["Insurance - General basic","Mandatory field - Do the below insurances apply to the applicant(s) and have they been accounted for:\n- House owners with home insurance\n- Car owners (accounted for each car)"]
["Insurance - Health, Sickness, Personal Accident & Life","Mandatory field - Do the below insurances apply to the applicant(s) and have they been accounted for:\n- Private Health - particularly where income is > $90,000 and applicant is single or > $180,000 for families\n- Income and life insurance "]
["Other Living Expenses","Mandatory field - This is to capture unique items not covered for in the above categories that may be applicable to the applicant(s)."]
["Child & Spousal Maintenance","Regular payments made by the applicant(s) for child or spousal maintenance. "]
["Rent/Board","Rental or board expense paid by the customer."]
["Total Credit Card Limit","Total credit card limit of all continuing credit cards."]
["Other Mortgage Repayments","Mortgage repayments of any other continuing mortgage repayments."]
["Other Liabilities","Any other commitments the borrower has such as personal loans, HEC’s."]
["Eligible Loan Amount","Where the NSR = FAIL an offer as to the maximum loan amount the customer can qualify for to pass the minimum NSR of 1x or 1.25x if > 50% of income is from untaxed sources. Otherwise the applied loan amount is shown."]
["Maximum Serviceable Loan Amount","This is an indication of the maximum loan amount that the borrower can service. "]

{"sheet":"User Guide - Commercial","index":14,"n_rows":40,"n_cols":2,"rows_kept":40,"cut":false,"hidden":false,"merged":[]}
["CRE Servicing Calculator"]
[]
["Field Name","Instruction"]
["Clear Form (BUTTON)","Allows the user to clear all fields in the calculator"]
["Applicant name","Applicants name"]
["New Loan Amount","Mandatory field - total loan amount including any capitalised fees"]
["Interest Rate","Mandatory field - actual interest rate of the proposed loan"]
["Documentation Type","Mandatory field - identify whether FullDoc or AltDoc income documentation"]
["Loan Term (Years)","Mandatory field -  the total loan term of the proposed loan (maximum term 30 years)"]
["I/O Term (Years)","The interest only term of the proposed loan. Left blank if not applicable (maximum term 5 years allowed)"]
["Loan 1-4 Loan Amount","Outstanding loan amount of external business loan"]
["Loan 1-4 Rate","Current interest rate of external business loan"]
["Loan 1-4 Actual Loan Repayment (Monthly)","Current monthly loan repayments under contract for external business loan"]
["Net Profit before Tax","Net Profit Before Tax per annum from business activities of applicant"]
["Depreciation","Depreciation expense per annum from the business activities of applicant (obtained from Profit & Loss statements)"]
["Proposed Net CRE Rental Income","100% of CRE rental income after outgoings paid for by landlord"]
["Amortisation","Amortisation expense per annum from business activities of the applicant (obtained from Profit & Loss statements)"]
["Proposed Gross Residential Rental Income","100% of gross residential rental income if to be received by the business"]
["Interest Paid","Actual interest paid per annum from the business (obtained from Profit & Loss statements)"]
["Directors Salaries/Fees/Super","Actual Directors Salaries/Fees/Superannuation payments per annum paid by the business activities of the applicant (obtained from Profit & Loss statements/personal tax returns). CARE: do not duplicate in personal income"]
["Other","Actual expenses per annum which are non-recurring and are paid by the business activities of the applicant (obtained from Profit & Loss statements)"]
["Earnings before Interest, Tax, Depreciation & Amortisation (EBITDA)","Formula: Summation of all business income and addbacks subject to 80% (Proposed Gross residential Rental Income)"]
["Total Add Backs","Formula: Summation of all add backs"]
["Status","For each applicant of the loan, what is their marital status. "]
["Couple With","Links applicants who are a couple for household income band selection for living expense benchmark. This field must be correctly completed for both individuals of a couple, where one member of a couple is not correctly linked the living expense will be calculated as an additional couple living expense. Drop down selection N/A, Non-Loan Party or Applicant “X” when another Applicant is applied with a Couple status"]
["Dependents","Number of child dependents, aged < 18, the Applicant has. Each dependent child must only be entered once per couple. If a dependent is entered for both individuals of a couple, that dependent will be counted twice."]
["Gross Annual Income","Gross annual income of applicant from acceptable taxable income sources external to business income. Do NOT include Directors Fees/Salary/Super if included in addbacks."]
["Untaxed Allowable Income","Income from acceptable untaxed income sources. Tax is not calculated on this income."]
["Gross Residential Rental Income (Other)","Rental income entered at 100%. For the purposes of allowable income for serviceability, 80% of this income is used for servicing. Care: do NOT enter if income has been included under Business Income."]
["Investment Property Loan Balance (personal name)","This is the total balance of investment loans held by the applicant. For tax purposes, negative gearing will be applied to the calculated taxable income. For company applicants, if this interest has been calculated in the SEIC then this field should not be populated."]
["Declared Living Expenses","Total personal living expenses per month declared by the customer (sum of all applicants declared living expenses)"]
["Rent/Board","Rental or board expense paid by the customer."]
["Total Credit Card Limit","Total credit card limit of all continuing credit cards."]
["Personal Mortgage Repayments","Mortgage repayments of any Personal continuing mortgage repayments."]
["Other Consumer Debt","Any other commitments the borrower has such as personal loans, child support, HEC’s."]
["Business Income (EBITDA + net personal contribution)","Formula: EBITDA plus Net Personal Contribution "]
["Interest Expenses","Formula: Total Interest Expenses per annum for all business debt (Pepper and external), including existing and proposed business loans"]
["Debt Repayments","Formula: Total contracted business debt repayments per annum including Proposed loan (if applicable, would include P&I repayments over residual term after any interest only period)"]
["Debt Service Coverage Ratio (DSCR)","Formula: Business Income divided by debt repayments"]
["DSCR Outcome","Formula: All mandatory fields to be completed otherwise shows incomplete, where ICR < 1.00 then result is FAIL otherwise result is PASS"]

{"sheet":"User Guide - SEIC","index":15,"n_rows":28,"n_cols":2,"rows_kept":28,"cut":false,"hidden":false,"merged":[]}
["User Guide - Self Employed Income Calculator (SEIC)"]
[]
["Field Name","Explanation"]
["Clear Form (BUTTON)","Allows the user to clear all fields in the calculator"]
["Apply Values","Applies outputs from Self- employed income Calc into the Servicing Calculator"]
["Return to Calculator (BUTTON)","Returns to Servicing Calculator."]
["Financials for year ended Most Recent Year","Year financial year ends of financial statement period"]
["Financials for year ended Previous Year","Year financial year ends of financial statement period"]
["Gross Business Income","Gross business income off Profit and Loss statement"]
["Less Expenses","Total expenses including COGS from Profit and Loss statement"]
["Plus Superannuation over 9.5%","Discretionary superannuation paid >9.5% of wages from Profit and Loss statement"]
["Plus Depreciation","As advised in Profit and Loss statement"]
["Interest /Leasing Charges","As advised in Profit and Loss statement"]
["Ongoing Loan Repayments","Business loan repayments that will continue after the settlement of subject Pepper loan"]
["Director Wages Applicant 1","Wages paid to director"]
["Director Wages Applicant 2","Wages paid to director"]
["Director Wages Applicant 3","Wages paid to director"]
["Director Wages Applicant 4","Wages paid to director"]
["Director Wages Applicant 5","Wages paid to director"]
["Director Wages Applicant 6","Wages paid to director"]
["Applicants Entitlement/Applicant 1","% ownership of  this applicant of Business/Company or Trust"]
["Applicants Entitlement/Applicant 2","% ownership of  this applicant of Business/Company or Trust"]
["Applicants Entitlement/Applicant 3","% ownership of  this applicant of Business/Company or Trust"]
["Applicants Entitlement/Applicant 4","% ownership of  this applicant of Business/Company or Trust"]
["Applicants Entitlement/Applicant 5","% ownership of  this applicant of Business/Company or Trust"]
["Applicants Entitlement/Applicant 6","% ownership of  this applicant of Business/Company or Trust"]
["Apply Values (BUTTON)","Applies outputs from SELF employed income calc into residential Servicing calculator"]
["Return To Calculator (BUTTON)","Returns to Servicing Calculator Tab"]

{"sheet":"Assessment Notes - Commercial","index":16,"n_rows":63,"n_cols":3,"rows_kept":63,"cut":false,"hidden":true,"merged":[[61,1,61,2],[62,1,62,2],[55,1,55,2],[56,1,56,2],[57,1,57,2],[58,1,58,2],[59,1,59,2],[60,1,60,2],[52,0,52,1],[0,2,0,3],[41,0,41,2],[42,0,42,1],[43,0,43,1],[44,0,44,1],[46,0,46,2],[47,0,47,1],[48,0,48,1],[49,0,49,1],[50,0,50,1],[51,0,51,1]]}
["UNDERWRITER NOTES- Commercial",null,"INSTRUCTIONS"]
["Background",null,"Summary of applicants background and business operation.Borrowing History, Lender,Industry Type, Industry Outlook, Management Experience"]
["Purpose",null,"To state whether the asset will be owner occupied or Investment. What is the reason for the money being borrowed. ( ie refinance from XXXBank)"]
["Loan Amount:",null,"Loan amount approved as a result of this assessment"]
["Global Exposure",null,"Total Loan Amount of all Pepper exposure held. If this is the only loan state \"No other exposure held\""]
["Loan term. Interest Only Term",null,"Loan structure . Ie Total loan term and term of interest only"]
["Security Estimate:",null,"Security value amount used for LVR calculation. "]
["NCCP- Yes or No- ",null,"If answered YES use Residential underwriting template"]
["Asset Class",null,"Description of asset class of security. Office, Medical, Retail, Industrial, Industrial Land, Mixed Residential/Commercial, Child Care, Boarding Houses."]
["Address",null,"Address of property being offered as security"]
["Location- Cat 1 or 2",null,"What is the security Property location category?"]
["LVR:",null,"LVR based on loan amount"]
["ICR",null,"Interest cover ratio as per output of Servicing Calculator. Min 1.50 times for Full doc loan and 1.75 times for Alt doc loan"]
["DSCR ",null,"Debt Service ratio as per outcome of Servicing Calculator. **Min 1.25 times for both Full Doc and Alt doc loans."]
["Product:",null,"Product that is recommended for approval. If this is different to what the customer has applied for then comment as to why "]
["Rental Terms: ",null,"Has a tenancy schedule been completed and attached. Does lease term align with expiry of loan if rental forms >50% of total available income to service."]
["Valuation Reviewed. ",null,"Valuation reviewed and acceptable. Refer separate valuation review checklist. Please comment on industry that the tenant is involved in."]
["Fraud Check on Directors",null,"What is the outcome of the Equifax Fraud check in NextGen? If a match, to be referred to Senior Manager to investigate the match"]
["PEP & Sanctions checked:",null,"Is the director/s  confirmed as being on the PEP or Sanctions register (not a potential match). If a match refer to dedicated team member for enhanced search. "]
["ID Document is clear and valid",null,"Have the correct, clear  identification documents and Customer Identification form been completed correctly, signed?"]
["Company & Trust Loans - Beneficial owner with greater than 25% ownership: ",null,"Non-individual entities: Has the correct information and documentation been collected to verify the customer to ensure we meet our AML obligations including the verification of identity of beneficial owners."]
["Directors Guarantee",null,"Is a directors guarantee being taken as part of security?"]
["Guarantors/Sponsors Statement of position",null,"Summary of assets and liabilities of . State main assets (ie home, car, etc) Excess assets over liabilities. State how applicant could meet a call of the guarantee."]
["Supporting Income",null,"What entity and supporting income included in loan assessment"]
["Equifax /commercial search.",null,"Comment on the credit bureau file. Where there is an adverse listing what is the reason and why is it accepted. If there are numerous inquiries and the customer has stated no liabilities - what investigations were done and what was the outcome.  If there are items that don't match the profile of the customer e.g. customer aged 50 and new credit file, document investigations completed.  Is the information on the credit file consistent with the information provided in the customer's application form e.g. in relation to liabilities."]
["Is a PPSR being taken as part of our security.",null,"Does the equifax search reveal a registered interest. State why a party has a secured interest over applicants property and how this could effect our interest."]
["APP 1 Veda",null,"Comment on the credit bureau file. Where there is an adverse listing what is the reason and why is it accepted. If there are numerous inquiries and the customer has stated no liabilities - what investigations were done and what was the outcome.  Is the information on the credit file consistent with the information provided in the customer's application form e.g. in relation to liabilities."]
["Guarantor 1 Income checked:",null,"Summary about the applicant, job, how long employed, income and what documents were used to verify that income and employment.  Is income reasonable for the borrower's employment and age. If self employed what does the applicants industry do."]
["APP 2 Veda",null,"Comment on the credit bureau file. Where there is an adverse listing what is the reason and why is it accepted. If there are numerous inquiries and the customer has stated no liabilities - what investigations were done and what was the outcome.  Is the information on the credit file consistent with the information provided in the customer's application form e.g. in relation to liabilities."]
["Guarantor 2 Income checked:",null,"Summary about the applicant, job, how long employed, income and what documents were used to verify that income and employment.  Is income reasonable for the borrower's employment and age. If self employed what does the applicants industry do."]
["Conduct assessed (Refinance)",null,"Refinance: Comment on conduct of any loans that are being refinanced and where adverse conduct exists why and mitigation. Confirm that 6 months statements held. "]
["Funds to complete ( Purchase):",null,"Purchase: Comment on where the funds to complete are coming from and have been verified. "]
["Other:"]
["Exceptions:",null,"Identify any exceptions and mitigation for the exception approval.  Exceptions required to be approved by Challenger"]
["Exception Register updated",null,"Has the exception to correctly recorded."]
["Conditions Precedent and subsequent",null,"Conditions that are to be included as part of the loan conditions both prior to loan draw down and post loan drawdown."]
["Recommendation:",null,"Recommendation of the deal if not with your DCA \" This file is recommended for approval.\""]
["Joint Approvers Notes",null,"\" This file is jointly approved \" "]
["App1 ABN: "]
["App2 ABN: "]
[]
["COMPLIANCE: "]
["Privacy Dec held: "]
["CRO & Features required: "]
["Customer Identification Form: "]
[]
["SE CHECK COMPLETE:"]
["CUSTOMER ID'D:"]
["Confirm requirements and objectives and benefit:\nIn reviewing the application, your requirements are (a) interest only payments, (b) lowest interest rate and objectives are to purchase the property at ......(address); or (b) refinance the debt with (lender); and/or (c) consolidate debt (i), (ii), (iii) etc . Is this correct? Are there any other requirements and objectives?"]
["Business operated and how long:"]
["Income confirmed:\nDo you expect an increase or decrease in your income over the next 3 years.  If a decrease, describe events that would cause this and your strategy to maintain your repayments / details of your exit strategy."]
["Confirm loan amount, product, interest rate & repayment with the borrower:\nIf there is an indication on the application which suggests financials are available for the borrower, we need to question if they are available, therefore advising they are entitled to a different product (Full Doc)."]
["Any other info:"]
[]
[]
[]
[null,"ACCOUNTANT CHECK COMPLETE:"]
[]
[null,"Called XXXX (verified on TPB - registration number XXXX) on phone number XXXX (internet site)"]
[null,"Confirmed prepared accounts since year XXXX"]
[null,"20XX NPBT $___ Deductions $___"]
[null,"20XX NPBT $___ Deductions $___"]
[null,"Other:"]

{"sheet":"Assessment Notes - Residential","index":17,"n_rows":53,"n_cols":6,"rows_kept":53,"cut":false,"hidden":true,"merged":[[47,3,47,5],[52,0,52,1],[52,3,52,5],[49,0,49,1],[49,3,49,5],[50,0,50,1],[50,3,50,5],[51,0,51,1],[51,3,51,5],[48,0,48,1],[48,3,48,5],[47,0,47,1],[27,0,27,1],[27,3,27,5],[28,2,30,2],[28,3,30,5],[31,0,46,0],[31,1,33,1],[31,2,33,2],[31,5,32,5],[34,1,42,1],[34,2,42,2],[43,1,46,1],[43,2,46,2],[43,5,44,5],[24,0,24,1],[24,3,24,5],[25,0,25,1],[25,3,25,5],[26,0,26,1],[26,3,26,5],[21,0,21,1],[21,3,21,5],[22,0,22,1],[22,3,22,5],[23,0,23,1],[23,3,23,5],[18,0,18,1],[18,3,18,5],[19,0,19,1],[19,3,19,5],[20,0,20,1],[20,3,20,5],[15,0,15,1],[15,3,15,5],[16,0,16,1],[16,3,16,5],[17,0,17,1],[17,3,17,5],[12,0,12,1],[12,3,12,5],[13,0,13,1],[13,3,13,5],[14,0,14,1],[14,3,14,5],[9,0,9,1],[9,4,9,5],[10,0,10,1],[10,3,10,5],[11,0,11,1],[11,3,11,5],[6,0,6,1],[6,3,6,5],[7,0,7,1],[7,3,7,5],[8,0,8,1],[8,3,8,5],[3,0,3,1],[3,3,3,5],[4,0,4,1],[4,3,4,5],[5,0,5,1],[5,3,5,5],[0,0,0,2],[0,3,0,5],[1,0,1,1],[1,3,1,5],[2,0,2,1],[2,3,2,5]]}
["UNDERWRITER NOTES",null,null,"INSTRUCTIONS"]
["Loan Amount - Requested: ",null,null,"Loan amount requested by customer at application. "]
["Loan Amount - Approved:  ",null,null,"Loan amount approved as a result of this assessment."]
["LPF / MRF: ",null,null,"LPF or MRF applicable to the approved loan amount."]
["Loan Amount - Final:   ",null,{"$f":"C3+C4","v":0},"Loan amount including any capitalised fees. This amount is to be entered into the Servicing Calculator for credit assessment purposes. "]
["Security Estimate:",null,null,"Security value amount used for LVR calculation. "]
["LVR - Initial: ",null,{"$f":"C3/C6","v":{"$error":"#DIV/0!"}},"LVR based on loan amount before capitalised fees. "]
["LVR - Final: ",null,{"$f":"C5/C6","v":{"$error":"#DIV/0!"}},"Total LVR based on loan amount plus capitalised fees. "]
["Global Exposure if other loans held",null,null,"Total Loan Amount and Total LVR of all Pepper exposure held. If this is the only loan \"No other exposure held\""]
["NSR **Min. 1.35x when end LVR >90%**: ",null,null,{"$f":"ResiAssessmentNSR","v":0},"NSR based on total loan amount (plus capitalised fees if applicable). Cannot be < 1x or where LVR > 90% cannot be < 1.35x or where income from government support is > 50% of total income cannot be <1.25x. "]
["Customers Requirements & Objectives:",null,null,"Comment on what the customers objective with the loan purpose is and whether the proposed loan meets the product requirements captured on the CRO form. "]
["Customer Benefit:",null,null,"What advantage is the customer receiving from the loan purpose and does this match with the Customers Requirements and Objectives."]
["Product:",null,null,"Product that is recommended for approval. If this is different to what the customer has applied for then comment as to why it still meets the Customers Requirements and Objectives."]
["Interest Only? (If O/O then document reason): ",null,null,"Why the applicant is seeking interest only  and whether the reasons are reasonable based on customers requirements and objectives, the purpose of the loan and the customers circumstances.  "]
["Security Category:",null,null,"What is the security property location Category? If Prime and requires Metro category note here. "]
["High Density Area?",null,null,"Is the security property a unit in a high density postcode with more than 35 units?"]
["Fraud check:",null,null,"What is the outcome of the Equifax Fraud check in NextGen? If a match, to be referred to Senior or Team Leader to investigate the match. "]
["PEP & Sanctions check: ",null,null,"Is the applicant confirmed as being on the PEP or Sanctions register (not a potential match). If a match refer to dedicated team member for enhanced search. "]
["ID document is clear and valid? ",null,null,"Have the correct, clear  identification documents and Customer Identification form been completed correctly, signed?"]
["Company & Trust Loans (>25% Owned): ",null,null,"Non-individual entities: Has the correct information and documentation been collected to verify the customer to ensure we meet our AML obligations including the verification of identity of beneficial owners."]
["Adverse Credit History (incl loan arrears) assessment:",null,null,"Comment on the credit bureau file. Where there is an adverse listing what is the reason and why is it accepted. If there are numerous inquiries and the customer has stated no liabilities - what investigations were done and what was the outcome.  If there are items that don't match the profile of the customer e.g. customer aged 50 and new credit file, document investigations completed.  Is the information on the credit file consistent with the information provided in the customer's application form e.g. in relation to liabilities."]
["Applicant 1 Income:",null,null,"Summary about the applicant, job, how long employed, income and what documents were used to verify that income and employment.  Is income reasonable for the borrower's employment and age. If self employed what does the applicants business do. "]
["Applicant 2 Income:",null,null,"Summary about the applicant, job, how long employed, income and what documents were used to verify that income and employment.  Is income reasonable for the borrower's employment and age. If self employed what does the applicants business do. "]
["COVID Impact (Greater Sydney customers)",null,null,"Has the customer(s) income been affected by COVID lockdowns. If not ascertainable from the application informaton, additional inquiry needs to be made of the customer. If income has been affected, how does the customer intend on navigating that income deterioation until the lockdown is lifted and income recommences."]
["Exit Strategy",null,null,"If the applicants are older than 50 years of age and the loan term exceeds the standard retirement age (67) of the oldest income reliant borrower an exit strategy of how the borower(s) will continue to meet their repayment obligations must be obtained. The borrower(s) exit strategy must be documented and the credit notes included as to why the exit strategy has been deemed reasonable and consistent with Customer's requirements and objectives."]
["Rental Income:",null,null,"Comment on what rental income is received and used in assessment and how was it verified. "]
["Conduct assessed (Refinance):",null,null,"Refinance: Comment on conduct of any loans that are being refinanced and where adverse conduct exists why and mitigation. Confirm that 6 months statements held. "]
["Funds to complete (Purchase):",null,null,"Purchase: Comment on where the funds to complete are coming from and have been verified. Have 5% genuine savings been verified on Prime > 90%"]
["Declared Living Expense ",{"$f":"Residential!R41","v":0},null,"Comment on whether DLE or benchmark has been relied upon and assessment to be made as to whether or not the declared living expenses are realistic and if so why. Where a declared living expense appears unrealisitc, is zero, or the declared living expense are less than 80% of benchmark, additional inquiry must be made with the broker / borrower and subsequently assessed. If the ratio is substantially over 100%, check if applicant has not doubled up anywhere eg included finance cost on property categories. If bank statements are provided comment on how the transactions on those statement support the DLE."]
["Living Expense Benchmark",{"$f":"Residential!R40","v":0}]
["Declared Living Expense % of Benchmark",{"$f":"B29/B30","v":{"$error":"#DIV/0!"}}]
["Living expense assessment:","Property costs",null,{"$f":"Residential!G50","v":0},{"$f":"Residential!C50","v":"Primary residence utilities, rates & expenses"},"Include council rates, water, gas & electricity utility bills and body corporate fees where applicable for property owned by the applicant. Assessment should account for these expenses giving account to the type of property (location, house or unit and size). This also includes annual property tax payments due under the First Home Buyer Choice stamp duty scheme - the rate of this tax is $400 plus 0.3% of the property value (https://www.nsw.gov.au/initiative/first-home-buyer-choice)"]
[null,null,null,{"$f":"Residential!G51","v":0},{"$f":"Residential!C51","v":"Primary residence strata fees & land tax & FHB property tax"}]
[null,null,null,{"$f":"Residential!G52","v":0},{"$f":"Residential!C52","v":"Investment property utilities, rates, strata fees & land tax"},"Include water, gas & electricity bills if the applicant is renting. Assessment should account for these expenses giving account to the type of property (location and size). "]
[null,"Living Expenses",null,{"$f":"Residential!G53","v":0},{"$f":"Residential!C53","v":"Telephone, internet, Pay TV & media streaming"},"Unless an applicant has a mobile phone supplied by their employer, it is expected that each applicant would have a mobile phone expense. If they have a home phone number, they may have a ‘bundle’ with a telco which includes internet."]
[null,null,null,{"$f":"Residential!G54","v":0},{"$f":"Residential!C54","v":"Groceries"},"It is expected that all applicants will have a grocery expense that is reasonable for their family unit size. "]
[null,null,null,{"$f":"Residential!G55","v":0},{"$f":"Residential!C55","v":"Recreation & Entertainment"},"It is expected that all applicants will have some form of recreation & entertainment cost. This includes alcohol, tobacco, gambling, restaurants and membership fees."]
[null,null,null,{"$f":"Residential!G56","v":0},{"$f":"Residential!C56","v":"Clothing & Personal Care"},"It is expected that all applicants will have clothing and personal care expenses that is reasonable for their family unit size. "]
[null,null,null,{"$f":"Residential!G57","v":0},{"$f":"Residential!C57","v":"Medical & Health"},"As an applicant’s age increase it is expected that medical and health costs will increase. In some case this cost may be $0 however given the customers circumstance it should be understood why through additional inquiry."]
[null,null,null,{"$f":"Residential!G58","v":0},{"$f":"Residential!C58","v":"Transport"},"It is expected that all applicants will have a transport cost that is reasonable for their assets and employment position. What are the running costs of each car owned including petrol and servicing or what are the costs of public transport where they commute for work. One exception may be where an applicant has one car only which is provided by their employer or running costs are already include in novated lease payments."]
[null,null,null,{"$f":"Residential!G62","v":0},{"$f":"Residential!C62","v":"Insurance - General Basic"},"Do the below insurances apply to the applicant(s) and have they been accounted for:\n- House owners with home insurance\n- Car owners (accounted for each car)"]
[null,null,null,{"$f":"Residential!G63","v":0},{"$f":"Residential!C63","v":"Insurance - Health, Sickness, Personal Accident & Life "},"Do the below insurances apply to the applicant(s) and have they been accounted for:\n- Private Health - particularly where income is > $90,000 and applicant is single or > $180,000 for families\n- Income and life insurance \n- Pet insurance "]
[null,null,null,{"$f":"Residential!G64","v":0},{"$f":"Residential!C64","v":"Other Living Expenses"},"This is to capture unique items not covered for in the above categories that may be applicable to the applicant(s)."]
[null,"Children",null,{"$f":"Residential!G59","v":0},{"$f":"Residential!C59","v":"Education – non Private schooling"},"Where the applicant(s) has school aged children is the declared amount reasonable to cover schools fees, uniform costs and books (if high school). Does the affluency of the applicant indicate that their children may attend a private school, if so, has this been declared by the customer. \n\n"]
[null,null,null,{"$f":"Residential!G60","v":0},{"$f":"Residential!C60","v":"Education - Private schooling "}]
[null,null,null,{"$f":"Residential!G65","v":0},{"$f":"Residential!C65","v":"Child & Spousal Maintenance "}]
[null,null,null,{"$f":"Residential!G61","v":0},{"$f":"Residential!C61","v":"Childcare"},"Where the applicant(s) has pre-school aged children and all applicants work, has a child care cost been included that is reasonable for the location accounting for any rebate that may be due. Where this is applicable and declared expense is $0 additional inquiry needs to be made."]
["Valuation: ",null,null,"COS/Estimate $Amount Date \nVAL $Amount Date \nCAT \nResidential Zoning?\nEssential Repairs? \nRisk ratings XXXX \nComp Sales XXXX \nSelling period within six months? \nAddressed to Pepper in Lender Specific Info? \nComments\n\nAcceptable Security: Yes/No"]
["Other:"]
["Exceptions:",null,null," conclusion and "]
["Recommendation (if assessor is not the DCA approver):",null,null,"If approval recommendation:\nRecommend for Approval. I have made reasonable enquiries to verify that the product will not be unsuitable to the customers’ requirements and objectives and the loan will not cause the customer substantial hardship.  "]
["Approval note:\n",null,null,"If assessor is the approver:\nApproval granted under my DCA. I have made the assessment and confirm that reasonable enquiries to verify that the loan meets the customer's requirements and objectives, is not unsuitable and will not cause the customer substantial hardship. This approval is valid for 90 days. \nIf approver was not the assessor:\nApproval granted under my DCA. I have reviewed the assessment and confirm that reasonable enquiries to verify that the loan meets the customer's requirements and objectives, is not unsuitable and will not cause the customer substantial hardship. This approval is valid for 90 days. \nFinal assessment made at the time of final approval:\nApproval granted under my DCA. I have confirm that reasonable enquiries to verify the customers financial situation and that the loan meets the customer's requirements and objectives, is not unsuitable and will not cause the customer substantial hardship. This approval is valid for 90 days. "]
["ABN search(s)",null,null,"Space for ABN search if not copied directly into NextGen."]

{"sheet":"Jackson Data Entry","index":18,"n_rows":21,"n_cols":16,"rows_kept":21,"cut":false,"hidden":true,"merged":[]}
["Serviceability Test Rate",{"$f":"ResiWAVGAssessmentRate","v":5.5E-2}]
["Actual NSR",{"$f":"ResiActualNSR","v":0}]
["Stressed NSR",{"$f":"ResiAssessmentNSR","v":0}]
["Actual DSR",{"$f":"Residential!E79","v":"-"}]
["Stressed DSR",{"$f":"Residential!M79","v":"-"}]
["Declared LE",{"$f":"Residential!E41","v":0}]
["LE Benchmark",{"$f":"Residential!R40","v":0}]
["Gross pre-shaded income",{"$f":"SUM(Residential!E19:E23,Residential!G19:G23,Residential!I19:I23,Residential!K19:K23,Residential!M19:M23,Residential!O19:O23,Residential!E25,Residential!G25,Residential!I25,Residential!K25,Residential!M25,Residential!O25)","v":0}]
["Primary Income",{"$f":"ResiTotalIncome","v":0}]
["Living Cost (Monthly)",{"$f":"Residential!M73","v":0}]
[]
[]
[]
[]
[]
[]
[]
[]
[]
[]
[null,null,null,null,null,null,null,null,null,null,null,null,null,null,null,"x`"]

{"sheet":"Cashflow Sensitivity Model","index":19,"n_rows":35,"n_cols":12,"rows_kept":35,"cut":false,"hidden":true,"merged":[[1,3,1,5]]}
["Cashflow Sensitivity Model",null,"Actuals","Best Case","Mid Case","Worst Case"]
[null,null,null,"Reductions in Sales of",null,null,null,null,null,null,null,"Scenarios"]
[null,null,null,0.1,0.25,0.5,"Select",null,null,null,null,"1. reduction in sales volume"]
["Sales",null,500,{"$f":"$C4*(1-D3)","v":450},{"$f":"$C4*(1-$E$3)","v":375},{"$f":"$C4*(1-$F$3)","v":250},"Enter actual sales in highlighted cell",null,null,null,null,"2. reduction in sales prices"]
[null,null,null,null,null,null,null,null,null,null,null,"3. both 1 and 2"]
["COGS",null,{"$f":"C4-C7","v":200},{"$f":"D4-D7","v":202.49999999999997},187.5,137.5]
["Gross Profit $",null,{"$f":"C8*C4","v":300},{"$f":"D8*D4","v":247.50000000000003},187.5,112.5]
["Gross Profit Margin %",null,0.6,0.55000000000000004,0.5,0.45,"Select"]
[]
["Other Variable Expenses"]
["Advertising & Marketing",null,5,{"$f":"$C11*(1-$D$3)","v":4.5},{"$f":"$C11*(1-$E$3)","v":3.75},{"$f":"$C11*(1-$F$3)","v":2.5}]
["Sub-Total",null,{"$f":"SUM(C10:C11)","v":5},{"$f":"SUM(D10:D11)","v":4.5},{"$f":"SUM(E10:E11)","v":3.75},{"$f":"SUM(F10:F11)","v":2.5}]
[]
["Fixed Expenses"]
["Salaries & Wages",null,1,1,1,1]
["Insurances",null,2,2,2,2]
["Superannuation",null,3,3,3,3]
["Property Expenses",null,4,4,4,4]
["Maintenance",null,5,5,5,5]
["Office Supplies",null,6,6,6,6]
["Professional Services",null,7,7,7,7]
["Interest",null,8,8,8,8]
["Leasing",null,9,9,9,9]
["Transport Costs",null,10,10,10,10]
["LHP",null,11,11,11,11]
["Sub-Total",null,{"$f":"SUM(C14:C25)","v":66},{"$f":"SUM(D14:D25)","v":66},66,66]
[]
["NPBT",null,{"$f":"C4-C6-C26-C12","v":229},{"$f":"D4-D6-D26-D12","v":177.00000000000003},117.75,44]
["NPBT %",null,{"$f":"C28/C4","v":0.45800000000000002},{"$f":"D28/D4","v":0.39333333333333342},{"$f":"E28/E4","v":0.314},{"$f":"F28/F4","v":0.17599999999999999}]
["NPAT",null,{"$f":"C28-C29","v":228.542},{"$f":"D28-D29","v":176.60666666666668},117.43600000000001,43.823999999999998]
[]
[]
["% Reduction in Sales",null,null,{"$f":"D3","v":0.1},{"$f":"E3","v":0.25},0.5]
["% Change in GP Ratio",null,null,{"$f":"(D8-C8)/C8","v":-8.3333333333333232E-2},{"$f":"(E8-D8)/D8","v":-9.0909090909090981E-2},-9.9999999999999978E-2]
["% Change in NPBT",null,null,{"$f":"(D28-C28)/C28","v":-0.22707423580786013},{"$f":"(E28-C28)/C28","v":-0.48580786026200873},{"$f":"(F28-C28)/C28","v":-0.80786026200873362}]

{"sheet":"YTD","index":20,"n_rows":17,"n_cols":8,"rows_kept":17,"cut":false,"hidden":true,"merged":[[0,0,0,6],[6,0,6,6],[12,0,12,6]]}
["YEAR-TO-DATE INCOME CALCULATOR"]
["Borrower Name"]
["Loan Id"]
["Start Date","Finish Date","No. of Days","Weeks","YTD Pay","Ave Per Week","Annualised","IF Casual @ 48w"]
["2020-07-01",null,{"$f":"B5-A5","v":-44013},{"$f":"C5/7","v":-6287.5714285714284},null,{"$f":"E5/D5","v":0},{"$f":"F5*52","v":0},{"$f":"G5/52*48","v":0}]
[]
["YEAR-TO-DATE INCOME CALCULATOR"]
["Borrower Name"]
["Loan Id"]
["Start Date","Finish Date","No. of Days","Weeks","YTD Pay","Ave Per Week","Annualised","IF Casual @ 48w"]
[{"$f":"A5","v":"2020-07-01"},null,{"$f":"B11-A11","v":-44013},{"$f":"C11/7","v":-6287.5714285714284},null,{"$f":"E11/D11","v":0},{"$f":"F11*52","v":0},{"$f":"G11/52*48","v":0}]
[]
["YEAR-TO-DATE INCOME CALCULATOR"]
["Borrower Name"]
["Loan Id"]
["Start Date","Finish Date","No. of Days","Weeks","YTD Pay","Ave Per Week","Annualised","IF Casual @ 48w"]
[{"$f":"A5","v":"2020-07-01"},null,{"$f":"B17-A17","v":-44013},{"$f":"C17/7","v":-6287.5714285714284},0,{"$f":"E17/D17","v":0},{"$f":"F17*52","v":0},{"$f":"G17/52*48","v":0}]

{"sheet":"Workings","index":21,"n_rows":1,"n_cols":1,"rows_kept":1,"cut":false,"hidden":true,"merged":[[0,0,0,6]]}
["Loan Affordability Calculator"]

{"sheet":"Rental Schedule","index":22,"n_rows":20,"n_cols":30,"rows_kept":20,"cut":false,"hidden":true,"merged":[[26,0,26,3],[1,0,1,1],[2,0,2,1],[22,0,22,3],[23,0,23,3],[25,0,25,3]]}
["Property Schedule"]
["Borrowers' name(s): "]
["Application number(s): "]
["Property Address","Owner(s)","% owned - Borrower 1","% owned - Borrower 2","% owned - Borrower 3","% owned - Borrower 4","Estimated value","Estimated rental","Rent period - select from list","Gross Annual Rent - Note 4.","Investment Loan Balance","Borrower 1 rental share - transfer to DSC","Borrower 2 rental share - transfer to DSC","Borrower 3 rental share - transfer to DSC","Borrower 4 rental share - transfer to DSC","Borrower 1 loan share - transfer to DSC","Borrower 2 loan share - transfer to DSC","Borrower 3 loan share - transfer to DSC","Borrower 4 loan share - transfer to DSC","Actual Interest %","Int deduction $ - Borrower 1","Int deduction $ - Borrower 2","Int deduction $ - Borrower 3","Int deduction $ - Borrower 4"]
[null,null,null,null,null,null,null,null,"Weekly",{"$f":"IF(I5=$AD$5,H5*52, IF(I5=$AD$6,H5*26, IF(I5=$AD$7,H5*12,\" \")))","v":0},null,{"$f":"J5*C5","v":0},{"$f":"J5*D5","v":0},{"$f":"J5*E5","v":0},{"$f":"J5*F5","v":0},{"$f":"K5*C5","v":0},{"$f":"K5*D5","v":0},{"$f":"K5*E5","v":0},{"$f":"K5*F5","v":0},null,{"$f":"T5*P5*C5","v":0},{"$f":"T5*Q5*D5","v":0},{"$f":"T5*R5*E5","v":0},{"$f":"T5*S5*F5","v":0},null,null,null,null,null,"Weekly"]
[null,null,null,null,null,null,null,null,"Weekly",{"$f":"IF(I6=$AD$5,H6*52, IF(I6=$AD$6,H6*26, IF(I6=$AD$7,H6*12,\" \")))","v":0},null,0,0,{"$f":"J6*E6","v":0},{"$f":"J6*F6","v":0},0,0,{"$f":"K6*E6","v":0},{"$f":"K6*F6","v":0},null,{"$f":"T6*Q6*C6","v":0},0,{"$f":"U6*R6*E6","v":0},0,null,null,null,null,null,"Fortnightly"]
[null,null,null,null,null,null,null,null,"Weekly",{"$f":"IF(I7=$AD$5,H7*52, IF(I7=$AD$6,H7*26, IF(I7=$AD$7,H7*12,\" \")))","v":0},null,0,0,0,0,0,0,0,0,null,{"$f":"T7*Q7*C7","v":0},0,0,0,null,null,null,null,null,"Monthly"]
[null,null,null,null,null,null,null,null,"Weekly",0,null,0,0,0,0,0,0,0,0,null,{"$f":"T8*Q8*C8","v":0},0,0,0,null,null,null,null,null,"Annually"]
[null,null,null,null,null,null,null,null,"Weekly",0,null,0,0,0,0,0,0,0,0,null,{"$f":"T9*Q9*C9","v":0},0,0,0]
[null,null,null,null,null,null,null,null,"Weekly",0,null,0,0,0,0,0,0,0,0,null,{"$f":"T10*Q10*C10","v":0},0,0,0]
[null,null,null,null,null,null,null,null,"Weekly",{"$f":"IF(I11=$AD$5,H11*52, IF(I11=$AD$6,H11*26, IF(I11=$AD$7,H11*12,\" \")))","v":0},null,{"$f":"J11*C11","v":0},{"$f":"J11*D11","v":0},{"$f":"J11*E11","v":0},{"$f":"J11*F11","v":0},{"$f":"K11*C11","v":0},{"$f":"K11*D11","v":0},{"$f":"K11*E11","v":0},{"$f":"K11*F11","v":0},null,{"$f":"T11*Q11*C11","v":0},{"$f":"T11*Q11*D11","v":0},{"$f":"U11*R11*E11","v":0},{"$f":"V11*S11*F11","v":0}]
[null,null,null,null,null,null,null,null,"Weekly",0,null,0,0,0,0,0,0,0,0,null,0,0,0,0]
[null,null,null,null,null,null,null,null,"Weekly",0,null,0,0,0,0,0,0,0,0,null,0,0,0,0]
[null,null,null,null,null,null,null,null,"Weekly",0,null,{"$f":"J14*C14","v":0},{"$f":"J14*D14","v":0},0,0,{"$f":"K14*C14","v":0},{"$f":"K14*D14","v":0},0,0,null,{"$f":"T14*Q14*C14","v":0},{"$f":"T14*Q14*D14","v":0},0,0]
[null,null,null,null,null,null,null,null,"Weekly",0,null,{"$f":"J15*C15","v":0},{"$f":"J15*D15","v":0},0,0,{"$f":"K15*C15","v":0},{"$f":"K15*D15","v":0},0,0,null,{"$f":"T15*Q15*C15","v":0},{"$f":"T15*Q15*D15","v":0},0,0]
[null,null,null,null,null,null,null,null,"Weekly",{"$f":"IF(I16=$AD$5,H16*52, IF(I16=$AD$6,H16*26, IF(I16=$AD$7,H16*12,\" \")))","v":0},null,{"$f":"J16*C16","v":0},{"$f":"J16*D16","v":0},0,0,{"$f":"K16*C16","v":0},{"$f":"K16*D16","v":0},0,0,null,{"$f":"T16*Q16*C16","v":0},{"$f":"T16*Q16*D16","v":0},0,0]
[null,null,null,null,null,null,null,null,"Weekly",0,null,0,0,0,0,0,0,0,0,null,0,0,0,0]
[null,null,null,null,null,null,null,null,"Weekly",0,null,0,0,0,0,0,0,0,0,null,0,0,0,0]
[null,null,null,null,null,null,null,null,"Weekly",0,null,0,0,0,0,0,0,{"$f":"K19*E19","v":0},{"$f":"K19*F19","v":0},null,0,0,0,0]
["TOTALS",null,null,null,null,null,{"$f":"SUM(G5:G19)","v":0},{"$f":"SUM(H5:H19)","v":0},null,{"$f":"SUM(J5:J19)","v":0},0,0,0,0,0,null,{"$f":"SUM(Q5:Q19)","v":0},{"$f":"SUM(R5:R19)","v":0},0,null,{"$f":"SUM(U5:U19)","v":0},{"$f":"SUM(V5:V19)","v":0},{"$f":"SUM(W5:W19)","v":0},0]